{"text_format":"1","workbook":"xlsx","n_sheets":3,"sheets":["アレルギー献立表 (中)","対象者","アレルゲン"],"not_rendered":{"charts":0,"images":1,"macros":1,"external_links":3,"defined_names":1,"comments":0,"pivot_tables":0},"unopened":[],"bounds":{"document_bytes":16777216,"sheet_cells":100000,"rows_first":2000,"rows_last":500,"rows_between":2000,"halvings":0,"cell_chars":16384,"cell_head_chars":4096},"cells_cut":0,"cells_raw":0,"read":"whole","date_system":"1900"}

{"sheet":"アレルギー献立表 (中)","index":0,"n_rows":240,"n_cols":8,"rows_kept":240,"cut":false,"hidden":false,"merged":[[87,0,101,0],[6,0,24,0],[25,0,37,0],[38,0,45,0],[46,0,53,0],[68,0,86,0],[187,0,203,0],[204,0,220,0],[221,0,230,0],[231,0,237,0],[102,0,113,0],[114,0,117,0],[131,0,149,0],[150,0,168,0],[169,0,172,0],[173,0,180,0]]}
[null,{"$f":"CONCATENATE(IFERROR(VLOOKUP($H$3,対象者!$A:$O,2,FALSE),\"\"),DBCS(IFERROR(VLOOKUP($H$3,対象者!$A:$O,3,FALSE),\"\")),IFERROR(IF($H$3=\"\",\"\",\"年\"),\"\"))","v":""},{"$f":"IFERROR(VLOOKUP($H$3,対象者!$A:$O,4,FALSE),\"\")","v":""},{"$f":"IFERROR(VLOOKUP($H$3,対象者!$A:$O,5,FALSE),\"\")","v":""},null,null," "]
[null,{"$f":"CONCATENATE(IFERROR(VLOOKUP($H$3,対象者!$A:$O,6,FALSE),\"\"),\" \",IFERROR(VLOOKUP($H$3,対象者!$A:$O,7,FALSE),\"\"))","v":" "},{"$f":"CONCATENATE(IFERROR(VLOOKUP($H$3,対象者!$A:$O,8,FALSE),\"\"),\" \",IFERROR(VLOOKUP($H$3,対象者!$A:$O,9,FALSE),\"\"))","v":" "},{"$f":"CONCATENATE(IFERROR(VLOOKUP($H$3,対象者!$A:$O,10,FALSE),\"\"),\" \",IFERROR(VLOOKUP($H$3,対象者!$A:$O,11,FALSE),\"\"))","v":" "},{"$f":"CONCATENATE(IFERROR(VLOOKUP($H$3,対象者!$A:$O,12,FALSE),\"\"),\" \",IFERROR(VLOOKUP($H$3,対象者!$A:$O,13,FALSE),\"\"))","v":" "},{"$f":"CONCATENATE(IFERROR(VLOOKUP($H$3,対象者!$A:$O,14,FALSE),\"\"),\" \",IFERROR(VLOOKUP($H$3,対象者!$A:$O,15,FALSE),\"\"))","v":" "}," ","番号"]
["　","令和6年度　6月アレルギー献立表",null,null,null,"中学校－１"," "]
["日","2024-06-03","2024-06-04","2024-06-05","2024-06-06","2024-06-07"," "]
["主食","麦ごはん","ごはん","◎●⑦クロワッサン","ごはん","ごはん"," "]
["牛乳","◎牛乳","◎牛乳","◎牛乳","◎牛乳","◎牛乳"," "]
["食缶","【豚丼の具】","【鶏団子汁】","【ミートソースペンネ】","【高野豆腐の卵とじ】","【五目汁】"," "]
[null,"　たまねぎ(84.5)　","⑧肉団子(32.5)　","　たまねぎ(52)　","○液卵(52)　","⑦豆腐(39)　"," "]
[null,"⑩豚肉(39)　","⑦豆腐(26)　","●マカロニ(29.9)　　","　たまねぎ(39)　","　じゃがいも(32.5)　"," "]
[null,"　しらたき(39)　","　大根(26)　","　トマト(26)　","　じゃがいも(26)　","　にんじん(13)　"," "]
[null,"⑦冷凍焼き豆腐(26)　","　にんじん(13)　","⑩豚肉(19.5)　","　にんじん(13)　","　小松菜(13)　"," "]
[null,"　ねぎ(16.9)　","　ねぎ(13)　","　にんじん(13)　","⑧鶏肉(13)　","　こんにゃく(13)　"," "]
[null,"　にんじん(13)　","●⑦しょうゆ(3.9)　","　マッシュルーム(6.5)　","　かまぼこ(13)　","　しいたけ(1.3)　"," "]
[null,"　エリンギ(13)　","　塩(0.65)　","　にんにく(0.65)　","　さやいんげん(6.5)　","●⑦しょうゆ(5.2)　"," "]
[null,"●⑦しょうゆ(7.8)　","　でん粉(1.04)　","　パセリ(0.07)　","⑦高野豆腐(6.5)　","　本みりん(1.3)　"," "]
[null,"　砂糖(3.9)　","　むろ削り(3.9)　","　トマトケチャップ\n　　　　　　　(19.5)　","●⑦しょうゆ(5.2)　","　塩(0.39)　"," "]
[null,"　酒(2.6)　","","　デミグラスソース\n　　　　　　　(10.4)　","　砂糖(2.6)　","　むろ削り(5.2)　"," "]
[null,"","","⑧チキンブイヨン(15.6)　","　本みりん(1.3)　",""," "]
[null,"","","　ソース(3.9)　","　塩(0.26)　",""," "]
[null,"","《デミグラスソース》","　赤ワイン(1.3)　","　むろ削り(3.25)　",""," "]
[null,"","●小麦粉","　砂糖(1.3)　","",""," "]
[null,"","　トマト","　オリーブ油(0.65)　",null,""," "]
[null,"","⑧⑩調味料等","　塩(0.39)　",null,""," "]
[null,"","","　こしょう(0.04)　",null,""," "]
[null,"","","",null,""," "]
["フライ缶","【きんぴらごぼう】","【サボテンコロッケ】","【コーンサラダ】","【ひじきサラダ】","【さば銀紙焼き】"," "]
[null,"　ごぼう(39)　","　サボテン入りコロッケ\n                   1個(60)　","　キャベツ(32.5)　","　まぐろ油漬け(15.6)　　","　さば銀紙焼き 1個(60)　"," "]
[null,"③牛肉(19.5)　","　米油(6)　","　とうもろこし(26)　","　冷凍ほうれん草(13)",""," "]
[null,"　ちくわ(6.5)　","","　きゅうり(13)　","　ほうれん草(13)","《さば銀紙焼き》"," "]
[null,"　にんじん(6.5)　","《サボテン入りコロッケ》","　にんじん(6.5)　","　にんじん(6.5)　","⑥さば"," "]
[null,"　さやいんげん(6.5)　","　じゃがいも","●⑦しょうゆ(1.56)　","　とうもろこし(6.5)　","⑦調味料等"," "]
[null,"④白ごま(1.3)　","　サボテン","　砂糖(1.3)　","④白ねりごま(6.5)　",""," "]
[null,"●⑦しょうゆ(4.55)　","●パン粉","　ワインビネガー(1.3)　","　米ひじき(2.6)　",""," "]
[null,"　砂糖(2.08)　","●小麦粉","　サラダ油(0.65)　","●⑦しょうゆ(2.6)　",""," "]
[null,"　本みりん(1.95)　","●⑦⑩調味料等","　塩(0.13)　","　米酢(1.95)　",""," "]
[null,"④ごま油(0.78)　","","　こしょう(0.03)　","　砂糖(1.3)　",""," "]
[null,"","","","　塩(0.13)　",""," "]
[null,"","","","",""," "]
["あえ物・果物","","【きゅうりときくらげの\n                   和え物】","","","【切り干し大根の\n               甘酢あえ】"," "]
[null,null,"　きゅうり(32.5)　",null,null,"　にんじん(6.5)　"," "]
[null,"","　黒きくらげ(0.13)　","","","　切り干し大根(2.86)　"," "]
[null,"","●⑦しょうゆ(1.56)　","","","　砂糖(1.56)　"," "]
[null,"","④ごま油(0.26)　","","","　米酢(1.56)　"," "]
[null,"","","","","④白ごま(0.65)　"," "]
[null,"","","","","　塩(0.13)　"," "]
[null,"","","","",null," "]
["その他","【ぶどうゼリー】","【いわしの干し小魚】","【フローズンヨーグルト】","【プルーン】","【きらず揚げ】"," "]
[null,"　ぶどうゼリー 1個(60)　","　いわしの干し小魚 \n　　　　　　１袋(5)　","◎ヨーグルト 1個(60)　","　プルーン  1袋(20)　","　きらず揚げ 1袋(8)　"," "]
[null,null,null,null,null,null," "]
[null,null,null,null,null,"《きらず揚げ》"," "]
[null,null,null,null,null,"●小麦粉"," "]
[null,null,null,null,null,"⑦おからパウダー"," "]
[null,"","","","","　調味料等"," "]
[null,"","","","",""," "]
["　",null,null,null,null,"（　）内は純使用量　単位：グラム"," "]
["※","アレルギー物質の21品目について、次のように表示しています。",null,null,null,null," "]
["　","○…卵","◎…乳","●…小麦","△…えび","▲…かに"," "]
["　","①…いか","②…オレンジ","③…牛肉","④…ごま","⑤…さけ"," "]
["　","⑥…さば","⑦…大豆","⑧…鶏肉","⑨…バナナ","⑩…豚肉"," "]
["　","⑪…もも","⑫…やまいも","⑬…りんご","⑭…ゼラチン",null," "]
["　","⑮…種実（ぎんなん・くり・ココナッツ）",null,null,"⑯…貝（あさり・ほたて等）",null," "]
["１","パンに表示される⑦大豆については、添加物のレシチンに含まれる微量のアレルゲンを示します。",null,null,null,null," "]
["２","アレルギー献立表の見方については、「保存版ＮＯ．１」を参照してください。",null,null,null,null," "]
["　",null,null,null,null,null," "]
["　",null,null,null,null,"中学校－２"," "]
["日","2024-06-10","2024-06-11","2024-06-12","2024-06-13","2024-06-14"," "]
["主食","麦ごはん","ごはん","●きしめん","麦ごはん","麦ごはん"," "]
["牛乳","◎牛乳","◎はっこう乳","◎牛乳","◎牛乳","◎牛乳"," "]
["食缶","【トッポギスープ】","【生揚げと豚肉の煮物】","【きしめんの汁】","【ミルク団子汁】","【えがおの\n　　　夏野菜カレー】"," "]
[null,"　たまねぎ(26)　","⑦生揚げ(52)　","⑧鶏肉(19.5)　","　白玉団子(26)　","　たまねぎ(52)　"," "]
[null,"　トッポギ(26)　","　たまねぎ(39)　","　大根(13)　","　じゃがいも(26)　","　かぼちゃ(39)　"," "]
[null,"⑧鶏肉(19.5)　","⑩豚肉(26)　","　ねぎ(13)　","⑩豚肉(19.5)　","　トマト(26)　"," "]
[null,"　チンゲンサイ(13)　","　大根(26)　","　小松菜(13)　","　大根(19.5)　","　なす(19.5)　"," "]
[null,"　にんじん(13)　","　こんにゃく(19.5)　","　かまぼこ(13)　","　にんじん(13)　","③牛肉(19.5)　"," "]
[null,"　とうもろこし(6.5)　","　にんじん(19.5)　","　にんじん(13)　","　ねぎ(10.4)　","　にんじん(13)　"," "]
[null,"　わかめ(0.39)　","　さやいんげん(6.5)　","⑦油揚げ(3.9)　","◎牛乳(19.5)　","　ピーマン(6.5)　"," "]
[null,"⑧⑩中華ガラスープの\n                    素(4.55)　                     ","●⑦しょうゆ(7.8)　","　しいたけ(1.3)　","⑦米みそ(10.4)　","　しょうが(0.65)　"," "]
[null,"●⑦しょうゆ(1.56)　","　砂糖(3.9)　","●⑦しょうゆ(8.45)　","　むろ削り(3.9)　","　にんにく(0.26)　"," "]
[null,"　酒(1.3)　","　本みりん(1.3)　","　本みりん(1.3)　","","　カレールウ\n　　　　(えがお)(13)　"," "]
[null,"　塩(0.13)　","　むろ削り(2.6)　","　塩(0.39)　",null,"⑦⑩洋風だしの素(1.95)　"," "]
[null,"　こしょう(0.04)　","","　でん粉(0.78)　","","　ソース(3.25)　"," "]
[null,"","","　むろ削り(5.2)　","","　トマトケチャップ\n　　　　　　　(2.6)　"," "]
[null,"","","","","●⑦しょうゆ(0.91)　"," "]
[null,"","","","","　純カレー(0.39)　"," "]
[null,"","","","","　塩(0.13)　"," "]
[null,"","","","","　こしょう(0.03)　"," "]
[null,"","","","",""," "]
["フライ缶","【ピリ辛大豆】","【あじのフリッター】","【たことえびのから揚げ】","【まぐろの甘辛煮】","【ポテトサラダ】"," "]
[null,"⑦大豆(32.5)　","　あじフリッター\n　　　　　3個(60)　","　たこから揚げ(32.5)　","　まぐろ油漬け(58.5)　","　じゃがいも(52)　"," "]
[null,"⑩豚肉(32.5)　","　米油(6)　","△小えびのから揚げ\n　　　　　　　(32.5)　","　キャベツ(15.6)　","⑩ポークハム(13)　"," "]
[null,"　たまねぎ(32.5)　","","　塩(0.13)　","　しょうが(1.3)　","　きゅうり(13)　"," "]
[null,"　にんじん(6.5)　","《あじフリッター》","　米油(6.5)　","　砂糖(3.9)　","　にんじん(6.5)　"," "]
[null,"⑦枝豆(6.5)　","　あじ",null,"●⑦しょうゆ(1.95)　","　卵なしマヨネーズ\n                      (7.8)　"," "]
[null,"　しょうが(0.39)　","●小麦粉",null,"　本みりん(1.3)　","　米酢(0.65)　"," "]
[null,"●⑦しょうゆ(3.25)　","△オキアミ",null,"　酒(1.3)　","　砂糖(0.65)　"," "]
[null,"　砂糖(0.78)　","●⑦調味料等",null,"","　こしょう(0.04)　"," "]
[null,"　酒(0.65)　","",null,"",""," "]
[null,"④ごま油(0.26)　","",null,"","《卵なしマヨネーズ》"," "]
[null,"⑦⑧⑩⑯中華だしの素\n                     (0.26)　","","","","⑦大豆粉"," "]
[null,"　一味唐辛子(0.04)　","","","","⑦粉末状植物たん白\n"," "]
[null,"　ガーリック\n　　　パウダー(0.01)　","","","","　調味料等"," "]
[null,"","","","",""," "]
["あえ物・果物","【冷凍みかん】","【もやしのナムル】","【きゅうりの梅和え】","【きざみたくあん】",""," "]
[null,"　みかん 1個(120)　","　もやし(39)　","　きゅうり(32.5)　","　たくあん漬け(16.9)　",""," "]
[null,"","④白すりごま(1.3)　","　梅びしお(1.95)　","",""," "]
[null,"","●⑦しょうゆ(1.3)　","●⑦しょうゆ(0.33)　","《たくあん漬け》",""," "]
[null,"","　砂糖(0.65)　","　砂糖(0.33)　","　大根",""," "]
[null,"","　米酢(0.65)　","","●⑦調味料等",""," "]
[null,null,"④ごま油(0.39)　","《梅びしお》",null,null," "]
[null,null,null,"　梅",null,null," "]
[null,null,null,"　梅肉",null,null," "]
[null,null,null,"　赤じそ",null,null," "]
[null,"",null,"⑬調味料等","",""," "]
[null,"","","","",""," "]
["その他","","","","【手巻きのり】",""," "]
[null,"","","","　手巻きのり 1袋(3)　",""," "]
[null,"","","","",""," "]
[null,"","","","",""," "]
["　",null,null,null,null,"（　）内は純使用量　単位：グラム"," "]
[null,null,null,null,null,null," "]
[null,null,null,null,null,null," "]
[null,null,null,null,null,null," "]
[null,null,null,null,null,null," "]
[null,null,null,null,null,null," "]
[null,null,null,null,null,null," "]
[null,null,null,null,null,null," "]
[null,null,null,null,null,null," "]
["　",null,null,null,null,"中学校－３"," "]
["日","2024-06-17","2024-06-18","2024-06-19","2024-06-20","2024-06-21"," "]
["主食","麦ごはん","麦ごはん","ごはん","ごはん","◎●⑦あいちの米粉パン"," "]
["牛乳","◎牛乳","◎牛乳","◎牛乳","◎牛乳","◎牛乳"," "]
["食缶","【中華海鮮うま煮】","【マーボ豆腐】","【肉じゃが】","【豚汁】","【大豆とチキンの\n　　　　　　トマト煮】"," "]
[null,"　たまねぎ(52)　","⑦豆腐(117)　","　じゃがいも(117)　","⑦豆腐(32.5)　","　たまねぎ(52)　"," "]
[null,"　キャベツ(45.5)　","　にんじん(32.5)　","　たまねぎ(52)　","　さといも(26)　","⑦大豆(45.5)　"," "]
[null,"○うずら卵(26)　","　たけのこ(26)　","　こんにゃく(26)　","⑩豚肉(26)　","　にんじん(26)　"," "]
[null,"①いか(26)　","⑩豚肉(26)　","　にんじん(26)　","　大根(19.5)　","　じゃがいも(26)　"," "]
[null,"△えび(26)　","　ねぎ(19.5)　","⑩豚肉(19.5)　","　にんじん(9.1)　","　トマト(26)　"," "]
[null,"　たけのこ(13)　","　しょうが(0.65)　","　グリンピース(5.2)　","　ごぼう(6.5)　","⑧鶏肉(19.5)　"," "]
[null,"　ちくわ(13)　","　にんにく(0.26)　","●⑦しょうゆ(5.85)　","　ねぎ(6.5)　","　とうもろこし(6.5)　"," "]
[null,"　にんじん(13)","⑦豆みそ(6.5)　","　砂糖(3.9)　","⑦豆みそ(11.7)　","　セロリ(2.6)　"," "]
[null,"●⑦しょうゆ(3.25)　","　砂糖(3.9)　","　本みりん(1.3)　","　むろ削り(3.9)　","　にんにく(0.39)　"," "]
[null,"　野菜ブイヨン(1.3)　","●⑦しょうゆ(2.99)　","　塩(0.26)　","","　トマトジュース(26)　"," "]
[null,"　砂糖(1.3)　","⑦⑧⑩⑯中華だしの素\n　　　　　　　(1.3)　","　こしょう(0.03)　","","　トマトケチャップ\n　　　　　　(9.1)　"," "]
[null,"　酒(1.3)　","　本みりん(1.3)　","","","　ソース(2.6)　"," "]
[null,"●⑦⑯オイスター\n　　　　ソース(1.3)　","　酒(1.3)　","","","　砂糖(2.6)　"," "]
[null,"④ごま油(0.39)　","④ごま油(1.04)　","","","⑦⑩洋風だしの素(1.3)　"," "]
[null,"　塩(0.13)　","　豆板醤(0.26)　","","","　赤ワイン(1.3)　"," "]
[null,"　こしょう(0.03)　","　でん粉(1.04)　","","","　塩(0.52)　"," "]
[null,"　でん粉(1.04)　","","","","　こしょう(0.07)　"," "]
[null,"","","","",""," "]
["フライ缶","【切り干し大根サラダ】","【バンバンジーサラダ】","【おひたし】","【めひかりフライ】","【サボテンの\n　　オリーブオイル炒め】"," "]
[null,"　きゅうり(13)　","　きゅうり(39)　","　もやし(32.5)　","●めひかりフライ \n　　　　　　3尾(45)　","⑩豚肉(39)　"," "]
[null,"　まぐろ油漬け(13)　","⑧サラダチキン(26)　","　キャベツ(13)　","　米油(3.9)　","　たまねぎ(26)　"," "]
[null,"　とうもろこし(13)　","　キャベツ(13)　","　にんじん(6.5)　","","　ズッキーニ(19.5)　"," "]
[null,"　にんじん(6.5)　","　にんじん(3.9)　","　ほうれん草(6.5)　",null,"　赤パプリカ(9.1)　"," "]
[null,"　切り干し大根(3.9)　","④白ねりごま(3.9)　","　かまぼこ(6.5)　",null,"　黄パプリカ(9.1)　"," "]
[null,"　卵なしマヨネーズ\n                      (7.8)　","④白すりごま(1.3)　","　しらす干し(2.6)　",null,"　うちわサボテン(3.9)　"," "]
[null,"●⑦しょうゆ(1.56)　","●⑦しょうゆ(2.34)　","④白すりごま(1.3)　",null,"    にんにく(0.13)　"," "]
[null,"④白すりごま(1.3)　","　砂糖(1.95)　","④白ごま(1.3)　","","●⑦⑯オイスター\n　　　　ソース (2.6)　"," "]
[null,"　米酢(0.65)　","　米酢(1.3)　","●⑦しょうゆ(1.95)　","","　酒(2.6)　"," "]
[null,"　砂糖(0.65)　","④ごま油(0.65)　","　砂糖(1.56)　","","●⑦しょうゆ(1.95)　"," "]
[null,"　塩(0.13)　","","　米酢(0.78)　","","　オリーブ油(0.65)　"," "]
[null,"　こしょう(0.04)　","","","","　塩(0.39)　"," "]
[null,null,null,null,null,null," "]
[null,"《卵なしマヨネーズ》",null,null,null,null," "]
[null,"⑦大豆粉",null,null,null,null," "]
[null,"⑦粉末状植物たん白",null,null,null,null," "]
[null,"　調味料等",null,null,null,null," "]
[null,"　","","","",""," "]
["あえ物・果物",null,"","","【キャベツのゆかり和え】",""," "]
[null,null,"","","　キャベツ(32.5)　",""," "]
[null,null,"","","　ゆかり粉(0.65)　",""," "]
[null,"","","","",""," "]
["その他","【ひじき佃煮】","","【型抜きチーズ】","【愛知のみかんゼリー】",""," "]
[null,"　ひじきのり佃煮\n　　　　　　1袋(10)　","","◎型抜きチーズ 1個(15)　","　愛知のみかんゼリー\n　　　　　　1個(60)　",""," "]
[null,null,null,null,null,null," "]
[null,"《ひじきのり佃煮》",null,null,null,null," "]
[null,"　のり",null,null,null,null," "]
[null,"　ひじき","","","",""," "]
[null,"●⑦調味料等",null,null,null,null," "]
[null,null,"","","",""," "]
["　",null,null,null,null,"（　）内は純使用量　単位：グラム"," "]
["　",null,null,null,null,null," "]
["　",null,null,null,null,"中学校－４"," "]
["日","2024-06-24","2024-06-25","2024-06-26","2024-06-27","2024-06-28"," "]
["主食","ごはん","わかめごはん","玄米ごはん","ごはん","◎●⑦サンドイッチ\n　　　　　　ロールパン"," "]
["牛乳","◎牛乳","◎牛乳","◎牛乳","◎牛乳","◎牛乳"," "]
["食缶","【もずく汁】","【かぼちゃ入りみそ汁】","【えがおの\n　　ハヤシシチュー】","【けんちん汁】","【野菜スープ】"," "]
[null,"⑧鶏肉(26)　","　かぼちゃ(32.5)　","　たまねぎ(52)　","⑦豆腐(26)　","　じゃがいも(26)　"," "]
[null,"⑫ながいも(19.5)　","⑦豆腐(32.5)　","　じゃがいも(45.5)　","　大根(26)　","　たまねぎ(26)　"," "]
[null,"　にんじん(13)　","　にんじん(13)　","⑩豚肉(26)　","　こんにゃく(19.5)　","⑧鶏肉(26)　"," "]
[null,"　かまぼこ(13)　","　たまねぎ(13)　","　にんじん(13)　","　にんじん(13)　","　もやし(13)　"," "]
[null,"　えのきたけ(13)　","　えのきたけ(6.5)　","　マッシュルーム(10.4)　","　ごぼう(13)　","　エリンギ(13)　"," "]
[null,"　ねぎ(13)　","　ねぎ(6.5)　","　にんにく(0.39)　","　ねぎ(13)　","　にんじん(13)　"," "]
[null,"　もずく(6.5)　","⑦油揚げ(2.6)　","　ハヤシルウ\n　　　　(えがお)(13)　","⑦油揚げ(2.6)　","　パセリ(0.04)　"," "]
[null,"　しょうが(0.65)　","⑦豆みそ(11.7)　","　トマトピューレ(13)　","●⑦しょうゆ(5.2)　","　白ワイン(2.6)　"," "]
[null,"●⑦しょうゆ(5.2)　","　本みりん(0.65)　","　トマトケチャップ\n　　　　　　　　(6.5)　","④ごま油(0.65)　","　野菜ブイヨン(1.95)　"," "]
[null,"　酒(1.3)　","　むろ削り(5.2)　","　ソース(2.6)　","　塩(0.39)　","●⑦しょうゆ(1.04)　"," "]
[null,"　塩(0.07)　","","　赤ワイン(1.3)　","　むろ削り(5.2)　","　塩(0.52)　"," "]
[null,"　むろ削り(3.9)　","","　野菜ブイヨン(0.65)　","","　オリーブ油(0.65)　"," "]
{"$rows_left_out":41}
{"sheet":"対象者","index":1,"n_rows":101,"n_cols":21,"rows_kept":101,"cut":false,"hidden":true,"merged":[]}
["番号","学校","学年","組","氏名","アレ１","１記号","アレ２","２記号","アレ３","３記号","アレ４","４記号","アレ５","５記号","アレ６","６記号","アレ７","７記号",1,"アレルゲンはドロップダウンリストから選択してください。"]
[1,null,null,null,null,null,"---",null,"---",null,"---",null,"---",null,"---",null,"---",null,"---",2,"アレルギー献立表に表示可能なアレルゲンは５種類までとなります。※６、７は参考入力"]
[2,null,null,null,null,null,"---",null,"---",null,"---",null,"---",null,"---",null,"---",null,"---","※","５種類を超えるアレルゲンのある場合は、弁当持参を促すべき児童生徒と言えます。"]
[3,null,null,null,null,null,"---",null,"---",null,"---",null,"---",null,"---",null,"---",null,"---",3,"このリストをアレルギー献立表の「対象者」シートにコピーして「値のみ」を貼り付けてください。"]
[4,null,null,null,null,null,"---",null,"---",null,"---",null,"---",null,"---",null,"---",null,"---",4,"対象者を100人以上登録したいときは、A100～R101を選択してコピー（又はオートフィル）してください。"]
[5,null,null,null,null,null,"---",null,"---",null,"---",null,"---",null,"---",null,"---",null,"---"]
[6,null,null,null,null,null,"---",null,"---",null,"---",null,"---",null,"---",null,"---",null,"---"]
[7,null,null,null,null,null,"---",null,"---",null,"---",null,"---",null,"---",null,"---",null,"---"]
[8,null,null,null,null,null,"---",null,"---",null,"---",null,"---",null,"---",null,"---",null,"---"]
[9,null,null,null,null,null,"---",null,"---",null,"---",null,"---",null,"---",null,"---",null,"---"]
[10,null,null,null,null,null,"---",null,"---",null,"---",null,"---",null,"---",null,"---",null,"---"]
[11,null,null,null,null,null,"---",null,"---",null,"---",null,"---",null,"---",null,"---",null,"---"]
[12,null,null,null,null,null,"---",null,"---",null,"---",null,"---",null,"---",null,"---",null,"---"]
[13,null,null,null,null,null,"---",null,"---",null,"---",null,"---",null,"---",null,"---",null,"---"]
[14,null,null,null,null,null,"---",null,"---",null,"---",null,"---",null,"---",null,"---",null,"---"]
[15,null,null,null,null,null,"---",null,"---",null,"---",null,"---",null,"---",null,"---",null,"---"]
[16,null,null,null,null,null,"---",null,"---",null,"---",null,"---",null,"---",null,"---",null,"---"]
[17,null,null,null,null,null,"---",null,"---",null,"---",null,"---",null,"---",null,"---",null,"---"]
[18,null,null,null,null,null,"---",null,"---",null,"---",null,"---",null,"---",null,"---",null,"---"]
[19,null,null,null,null,null,"---",null,"---",null,"---",null,"---",null,"---",null,"---",null,"---"]
[20,null,null,null,null,null,"---",null,"---",null,"---",null,"---",null,"---",null,"---",null,"---"]
[21,null,null,null,null,null,"---",null,"---",null,"---",null,"---",null,"---",null,"---",null,"---"]
[22,null,null,null,null,null,"---",null,"---",null,"---",null,"---",null,"---",null,"---",null,"---"]
[23,null,null,null,null,null,"---",null,"---",null,"---",null,"---",null,"---",null,"---",null,"---"]
[24,null,null,null,null,null,"---",null,"---",null,"---",null,"---",null,"---",null,"---",null,"---"]
[25,null,null,null,null,null,"---",null,"---",null,"---",null,"---",null,"---",null,"---",null,"---"]
[26,null,null,null,null,null,"---",null,"---",null,"---",null,"---",null,"---",null,"---",null,"---"]
[27,null,null,null,null,null,"---",null,"---",null,"---",null,"---",null,"---",null,"---",null,"---"]
[28,null,null,null,null,null,"---",null,"---",null,"---",null,"---",null,"---",null,"---",null,"---"]
[29,null,null,null,null,null,"---",null,"---",null,"---",null,"---",null,"---",null,"---",null,"---"]
[30,null,null,null,null,null,"---",null,"---",null,"---",null,"---",null,"---",null,"---",null,"---"]
[31,null,null,null,null,null,"---",null,"---",null,"---",null,"---",null,"---",null,"---",null,"---"]
[32,null,null,null,null,null,"---",null,"---",null,"---",null,"---",null,"---",null,"---",null,"---"]
[33,null,null,null,null,null,"---",null,"---",null,"---",null,"---",null,"---",null,"---",null,"---"]
[34,null,null,null,null,null,"---",null,"---",null,"---",null,"---",null,"---",null,"---",null,"---"]
[35,null,null,null,null,null,"---",null,"---",null,"---",null,"---",null,"---",null,"---",null,"---"]
[36,null,null,null,null,null,"---",null,"---",null,"---",null,"---",null,"---",null,"---",null,"---"]
[37,null,null,null,null,null,"---",null,"---",null,"---",null,"---",null,"---",null,"---",null,"---"]
[38,null,null,null,null,null,"---",null,"---",null,"---",null,"---",null,"---",null,"---",null,"---"]
[39,null,null,null,null,null,"---",null,"---",null,"---",null,"---",null,"---",null,"---",null,"---"]
[40,null,null,null,null,null,"---",null,"---",null,"---",null,"---",null,"---",null,"---",null,"---"]
[41,null,null,null,null,null,"---",null,"---",null,"---",null,"---",null,"---",null,"---",null,"---"]
[42,null,null,null,null,null,"---",null,"---",null,"---",null,"---",null,"---",null,"---",null,"---"]
[43,null,null,null,null,null,"---",null,"---",null,"---",null,"---",null,"---",null,"---",null,"---"]
[44,null,null,null,null,null,"---",null,"---",null,"---",null,"---",null,"---",null,"---",null,"---"]
[45,null,null,null,null,null,"---",null,"---",null,"---",null,"---",null,"---",null,"---",null,"---"]
[46,null,null,null,null,null,"---",null,"---",null,"---",null,"---",null,"---",null,"---",null,"---"]
[47,null,null,null,null,null,"---",null,"---",null,"---",null,"---",null,"---",null,"---",null,"---"]
[48,null,null,null,null,null,"---",null,"---",null,"---",null,"---",null,"---",null,"---",null,"---"]
[49,null,null,null,null,null,"---",null,"---",null,"---",null,"---",null,"---",null,"---",null,"---"]
[50,null,null,null,null,null,"---",null,"---",null,"---",null,"---",null,"---",null,"---",null,"---"]
[51,null,null,null,null,null,"---",null,"---",null,"---",null,"---",null,"---",null,"---",null,"---"]
[52,null,null,null,null,null,"---",null,"---",null,"---",null,"---",null,"---",null,"---",null,"---"]
[53,null,null,null,null,null,"---",null,"---",null,"---",null,"---",null,"---",null,"---",null,"---"]
[54,null,null,null,null,null,"---",null,"---",null,"---",null,"---",null,"---",null,"---",null,"---"]
[55,null,null,null,null,null,"---",null,"---",null,"---",null,"---",null,"---",null,"---",null,"---"]
[56,null,null,null,null,null,"---",null,"---",null,"---",null,"---",null,"---",null,"---",null,"---"]
[57,null,null,null,null,null,"---",null,"---",null,"---",null,"---",null,"---",null,"---",null,"---"]
[58,null,null,null,null,null,"---",null,"---",null,"---",null,"---",null,"---",null,"---",null,"---"]
[59,null,null,null,null,null,"---",null,"---",null,"---",null,"---",null,"---",null,"---",null,"---"]
[60,null,null,null,null,null,"---",null,"---",null,"---",null,"---",null,"---",null,"---",null,"---"]
[61,null,null,null,null,null,"---",null,"---",null,"---",null,"---",null,"---",null,"---",null,"---"]
[62,null,null,null,null,null,"---",null,"---",null,"---",null,"---",null,"---",null,"---",null,"---"]
[63,null,null,null,null,null,"---",null,"---",null,"---",null,"---",null,"---",null,"---",null,"---"]
[64,null,null,null,null,null,"---",null,"---",null,"---",null,"---",null,"---",null,"---",null,"---"]
[65,null,null,null,null,null,"---",null,"---",null,"---",null,"---",null,"---",null,"---",null,"---"]
[66,null,null,null,null,null,"---",null,"---",null,"---",null,"---",null,"---",null,"---",null,"---"]
[67,null,null,null,null,null,"---",null,"---",null,"---",null,"---",null,"---",null,"---",null,"---"]
[68,null,null,null,null,null,"---",null,"---",null,"---",null,"---",null,"---",null,"---",null,"---"]
[69,null,null,null,null,null,"---",null,"---",null,"---",null,"---",null,"---",null,"---",null,"---"]
[70,null,null,null,null,null,"---",null,"---",null,"---",null,"---",null,"---",null,"---",null,"---"]
[71,null,null,null,null,null,"---",null,"---",null,"---",null,"---",null,"---",null,"---",null,"---"]
[72,null,null,null,null,null,"---",null,"---",null,"---",null,"---",null,"---",null,"---",null,"---"]
[73,null,null,null,null,null,"---",null,"---",null,"---",null,"---",null,"---",null,"---",null,"---"]
[74,null,null,null,null,null,"---",null,"---",null,"---",null,"---",null,"---",null,"---",null,"---"]
[75,null,null,null,null,null,"---",null,"---",null,"---",null,"---",null,"---",null,"---",null,"---"]
[76,null,null,null,null,null,"---",null,"---",null,"---",null,"---",null,"---",null,"---",null,"---"]
[77,null,null,null,null,null,"---",null,"---",null,"---",null,"---",null,"---",null,"---",null,"---"]
[78,null,null,null,null,null,"---",null,"---",null,"---",null,"---",null,"---",null,"---",null,"---"]
[79,null,null,null,null,null,"---",null,"---",null,"---",null,"---",null,"---",null,"---",null,"---"]
[80,null,null,null,null,null,"---",null,"---",null,"---",null,"---",null,"---",null,"---",null,"---"]
[81,null,null,null,null,null,"---",null,"---",null,"---",null,"---",null,"---",null,"---",null,"---"]
[82,null,null,null,null,null,"---",null,"---",null,"---",null,"---",null,"---",null,"---",null,"---"]
[83,null,null,null,null,null,"---",null,"---",null,"---",null,"---",null,"---",null,"---",null,"---"]
[84,null,null,null,null,null,"---",null,"---",null,"---",null,"---",null,"---",null,"---",null,"---"]
[85,null,null,null,null,null,"---",null,"---",null,"---",null,"---",null,"---",null,"---",null,"---"]
[86,null,null,null,null,null,"---",null,"---",null,"---",null,"---",null,"---",null,"---",null,"---"]
[87,null,null,null,null,null,"---",null,"---",null,"---",null,"---",null,"---",null,"---",null,"---"]
[88,null,null,null,null,null,"---",null,"---",null,"---",null,"---",null,"---",null,"---",null,"---"]
[89,null,null,null,null,null,"---",null,"---",null,"---",null,"---",null,"---",null,"---",null,"---"]
[90,null,null,null,null,null,"---",null,"---",null,"---",null,"---",null,"---",null,"---",null,"---"]
[91,null,null,null,null,null,"---",null,"---",null,"---",null,"---",null,"---",null,"---",null,"---"]
[92,null,null,null,null,null,"---",null,"---",null,"---",null,"---",null,"---",null,"---",null,"---"]
[93,null,null,null,null,null,"---",null,"---",null,"---",null,"---",null,"---",null,"---",null,"---"]
[94,null,null,null,null,null,"---",null,"---",null,"---",null,"---",null,"---",null,"---",null,"---"]
[95,null,null,null,null,null,"---",null,"---",null,"---",null,"---",null,"---",null,"---",null,"---"]
[96,null,null,null,null,null,"---",null,"---",null,"---",null,"---",null,"---",null,"---",null,"---"]
[97,null,null,null,null,null,"---",null,"---",null,"---",null,"---",null,"---",null,"---",null,"---"]
[98,null,null,null,null,null,"---",null,"---",null,"---",null,"---",null,"---",null,"---",null,"---"]
[99,null,null,null,null,null,"---",null,"---",null,"---",null,"---",null,"---",null,"---",null,"---"]
[100,null,null,null,null,null,"---",null,"---",null,"---",null,"---",null,"---",null,"---",null,"---"]

{"sheet":"アレルゲン","index":2,"n_rows":5,"n_cols":4,"rows_kept":5,"cut":false,"hidden":true,"merged":[]}
[1,{"$f":"VLOOKUP(D$1,対象者!$A:$S,7,FALSE)","v":{"$error":"#N/A"}},"個人番号",{"$f":"'アレルギー献立表 (中)'!H3","v":0}]
[2,{"$f":"VLOOKUP(D$1,対象者!$A:$S,9,FALSE)","v":{"$error":"#N/A"}}]
[3,{"$f":"VLOOKUP(D$1,対象者!$A:$S,11,FALSE)","v":{"$error":"#N/A"}}]
[4,{"$f":"VLOOKUP(D$1,対象者!$A:$S,13,FALSE)","v":{"$error":"#N/A"}}]
[5,{"$f":"VLOOKUP(D$1,対象者!$A:$S,15,FALSE)","v":{"$error":"#N/A"}}]