{"text_format":"1","workbook":"xlsx","n_sheets":3,"sheets":["アレルギー献立表(小)","対象者","アレルゲン"],"not_rendered":{"charts":0,"images":1,"macros":1,"external_links":1,"defined_names":1,"comments":0,"pivot_tables":0},"unopened":[],"bounds":{"document_bytes":16777216,"sheet_cells":100000,"rows_first":2000,"rows_last":500,"rows_between":2000,"halvings":0,"cell_chars":16384,"cell_head_chars":4096},"cells_cut":0,"cells_raw":0,"read":"whole","date_system":"1900"}

{"sheet":"アレルギー献立表(小)","index":0,"n_rows":242,"n_cols":8,"rows_kept":242,"cut":false,"hidden":false,"merged":[[189,0,205,0],[206,0,222,0],[223,0,232,0],[233,0,239,0],[102,0,113,0],[114,0,117,0],[131,0,149,0],[150,0,168,0],[169,0,174,0],[175,0,182,0],[87,0,101,0],[6,0,24,0],[25,0,37,0],[38,0,45,0],[46,0,53,0],[68,0,86,0]]}
[null,{"$f":"CONCATENATE(IFERROR(VLOOKUP($H$3,対象者!$A:$O,2,FALSE),\"\"),DBCS(IFERROR(VLOOKUP($H$3,対象者!$A:$O,3,FALSE),\"\")),IFERROR(IF($H$3=\"\",\"\",\"年\"),\"\"))","v":""},{"$f":"IFERROR(VLOOKUP($H$3,対象者!$A:$O,4,FALSE),\"\")","v":""},{"$f":"IFERROR(VLOOKUP($H$3,対象者!$A:$O,5,FALSE),\"\")","v":""},null,null," "]
[null,{"$f":"CONCATENATE(IFERROR(VLOOKUP($H$3,対象者!$A:$O,6,FALSE),\"\"),\" \",IFERROR(VLOOKUP($H$3,対象者!$A:$O,7,FALSE),\"\"))","v":" "},{"$f":"CONCATENATE(IFERROR(VLOOKUP($H$3,対象者!$A:$O,8,FALSE),\"\"),\" \",IFERROR(VLOOKUP($H$3,対象者!$A:$O,9,FALSE),\"\"))","v":" "},{"$f":"CONCATENATE(IFERROR(VLOOKUP($H$3,対象者!$A:$O,10,FALSE),\"\"),\" \",IFERROR(VLOOKUP($H$3,対象者!$A:$O,11,FALSE),\"\"))","v":" "},{"$f":"CONCATENATE(IFERROR(VLOOKUP($H$3,対象者!$A:$O,12,FALSE),\"\"),\" \",IFERROR(VLOOKUP($H$3,対象者!$A:$O,13,FALSE),\"\"))","v":" "},{"$f":"CONCATENATE(IFERROR(VLOOKUP($H$3,対象者!$A:$O,14,FALSE),\"\"),\" \",IFERROR(VLOOKUP($H$3,対象者!$A:$O,15,FALSE),\"\"))","v":" "}," ","番号"]
["　","令和6年度　6月アレルギー献立表",null,null,null,"小学校－１"," "]
["日","2024-06-03","2024-06-04","2024-06-05","2024-06-06","2024-06-07"," "]
["主食","ごはん","麦ごはん","◎●⑦クロワッサン","ごはん","ごはん"," "]
["牛乳","◎牛乳","◎牛乳","◎牛乳","◎牛乳","◎牛乳"," "]
["食缶","【鶏団子汁】","【豚丼の具】","【ミートソースペンネ】","【高野豆腐の卵とじ】","【五目汁】"," "]
[null,"⑧肉団子(25)　","　たまねぎ(65)　","　たまねぎ(40)　","○液卵(40)　","⑦豆腐(30)　"," "]
[null,"⑦豆腐(20)　","⑩豚肉(30)　","●マカロニ(23)　","　たまねぎ(30)　","　じゃがいも(25)　"," "]
[null,"　大根(20)　","　しらたき(30)　","　トマト(20)　","　じゃがいも(20)　","　にんじん(10)　"," "]
[null,"　にんじん(10)　","⑦焼き豆腐(20)　","⑩豚肉(15)　","　にんじん(10)　","　小松菜(10)　"," "]
[null,"　ねぎ(10)　","　ねぎ(13)　","　にんじん(10)　","⑧鶏肉(10)　","　こんにゃく(10)　"," "]
[null,"●⑦しょうゆ(3)　","　にんじん(10)　","　マッシュルーム(5)　","　かまぼこ(10)　","　しいたけ(1)　"," "]
[null,"　塩(0.5)　","　エリンギ(10)　","　にんにく(0.5)　","　さやいんげん(5)　","●⑦しょうゆ(4)　"," "]
[null,"　でん粉(0.8)　","●⑦しょうゆ(6)　","　パセリ(0.05)　","⑦高野豆腐(5)　","　本みりん(1)　"," "]
[null,"　むろ削り(3)　","　砂糖(3)　","　トマトケチャップ\n                      (15)　","●⑦しょうゆ(4)　","　塩(0.3)　"," "]
[null,"","　酒(2)　","　デミグラスソース(8)　","　砂糖(2)　","　むろ削り(4)　"," "]
[null,null,"","⑧チキンブイヨン(12)　","　本みりん(1)　",""," "]
[null,null,"","　ソース(3)　","　塩(0.2)　",""," "]
[null,null,"","　赤ワイン(1)　","　むろ削り(2.5)　",""," "]
[null,null,"《デミグラスソース》","　砂糖(1)　","",""," "]
[null,"","●小麦粉","　オリーブ油(0.5)　","",""," "]
[null,"","　トマト","　塩(0.3)　","",""," "]
[null,"","⑧⑩調味料等","　こしょう(0.03)　","",""," "]
[null,"","","","",""," "]
["フライ缶","【サボテンコロッケ】","【きんぴらごぼう】","【コーンサラダ】","【ひじきサラダ】","【さば銀紙焼き】"," "]
[null,"　サボテン入りコロッケ\n                    1個 (50)　","　ごぼう(30)　","　キャベツ(25)　","　まぐろ油漬け(12)　","　さば銀紙焼き1個(50)　"," "]
[null,"　米油(5)　","③牛肉(15)　","　とうもろこし(20)　","　冷凍ほうれん草(10)　",""," "]
[null,"","　ちくわ(5)　","　きゅうり(10)　","　ほうれん草(10)","《さば銀紙焼き》"," "]
[null,"《サボテン入りコロッケ》","　にんじん(5)　","　にんじん(5)　","　にんじん(5)　","⑥さば"," "]
[null,"　じゃがいも","　さやいんげん(5)　","●⑦しょうゆ(1.2)　","　とうもろこし(5)　","⑦調味料等"," "]
[null,"　サボテン","④白ごま(1)　","　砂糖(1)　","④白ねりごま(5)　",""," "]
[null,"●パン粉","●⑦しょうゆ(3.5)　","　ワインビネガー(1)　","　米ひじき(2)　",""," "]
[null,"●小麦粉","　砂糖(1.6)　","　サラダ油(0.5)　","●⑦しょうゆ(2)　",""," "]
[null,"●⑦⑩調味料等","　本みりん(1.5)　","　塩(0.1)　","　米酢(1.5)　",""," "]
[null,"","④ごま油(0.6)　","　こしょう(0.02)　","　砂糖(1)　",""," "]
[null,"","","","　塩(0.1)　",""," "]
[null,"","","","",""," "]
["あえ物・果物","【きゅうりときくらげの\n                      和え物】","","","","【切り干し大根の\n                甘酢あえ】"," "]
[null,"　きゅうり(25)　","","","","　にんじん(5)"," "]
[null,"　黒きくらげ(0.1)　","","","","　切り干し大根(2.2)　　"," "]
[null,"●⑦しょうゆ(1.2)　","","","","　砂糖(1.2)　"," "]
[null,"④ごま油(0.2)　","","","","　米酢(1.2)　"," "]
[null,"","","","","④白ごま(0.5)　"," "]
[null,"","","","","　塩(0.1)　"," "]
[null,"","","","",""," "]
["その他","【ぶどうゼリー】","【いわしの干し小魚】","【フローズンヨーグルト】","【プルーン】","【きらず揚げ】"," "]
[null,"　ぶどうゼリー 1個(70)　","　いわし干し小魚 \n               １袋(5)　","◎ヨーグルト 1個(60)　","　プルーン 1袋(20)　","　きらず揚げ 1袋(8)　"," "]
[null,"","","","",""," "]
[null,null,null,null,null,"《きらず揚げ》"," "]
[null,null,null,null,null,"●小麦粉"," "]
[null,null,null,null,null,"⑦おからパウダー"," "]
[null,null,null,null,null,"    調味料等"," "]
[null,"","","","","　"," "]
["　",null,null,null,null,"（　）内は純使用量　単位：グラム"," "]
["※","アレルギー物質の21品目について、次のように表示しています。",null,null,null,null," "]
["　","○…卵","◎…乳","●…小麦","△…えび","▲…かに"," "]
["　","①…いか","②…オレンジ","③…牛肉","④…ごま","⑤…さけ"," "]
["　","⑥…さば","⑦…大豆","⑧…鶏肉","⑨…バナナ","⑩…豚肉"," "]
["　","⑪…もも","⑫…やまいも","⑬…りんご","⑭…ゼラチン",null," "]
["　","⑮…種実（ぎんなん・くり・ココナッツ）",null,null,"⑯…貝（あさり・ほたて等）",null," "]
["１","パンに表示される⑦大豆については、添加物のレシチンに含まれる微量のアレルゲンを示します。",null,null,null,null," "]
["２","アレルギー献立表の見方については、「保存版ＮＯ．１」を参照してください。",null,null,null,null," "]
["　",null,null,null,null,null," "]
["　",null,null,null,null,"小学校－２"," "]
["日","2024-06-10","2024-06-11","2024-06-12","2024-06-13","2024-06-14"," "]
["主食","麦ごはん","ごはん","麦ごはん","麦ごはん","●きしめん"," "]
["牛乳","◎牛乳","◎はっこう乳","◎牛乳","◎牛乳","◎牛乳"," "]
["食缶","【トッポギスープ】","【生揚げと豚肉の煮物】","【えがおの\n           夏野菜カレー】","【ミルク団子汁】","【きしめんの汁】"," "]
[null,"　たまねぎ(20)　","⑦生揚げ(40)　","　たまねぎ(40)　","　白玉団子(20)　","⑧鶏肉(15)　"," "]
[null,"　トッポギ(20)　","　たまねぎ(30)　","　かぼちゃ(30)　","　じゃがいも(20)　","　大根(10)　"," "]
[null,"⑧鶏肉(15)","⑩豚肉(20)　","　トマト(20)　","⑩豚肉(15)　","　ねぎ(10)　"," "]
[null,"　チンゲンサイ(10)　","　大根(20)　","　なす(15)　","　大根(15)　","　小松菜(10)　"," "]
[null,"　にんじん(10)　","　こんにゃく(15)　","③牛肉(15)　","　にんじん(10)　","　かまぼこ(10)　"," "]
[null,"　とうもろこし(5)　","　にんじん(15)　","　にんじん(10)　","　ねぎ(8)　","　にんじん(10)　"," "]
[null,"　わかめ(0.3)　","　さやいんげん(5)　","　ピーマン(5)　","◎牛乳(15)　","⑦油揚げ(3)　"," "]
[null,"⑧⑩中華ガラスープの\n                    素  (3.5)　","●⑦しょうゆ(6)　","　しょうが(0.5)　","⑦米みそ(8)　","　しいたけ(1)　"," "]
[null,"●⑦しょうゆ(1.2)　","　砂糖(3)　","　にんにく(0.2)　","　むろ削り(3)　","●⑦しょうゆ(6.5)　"," "]
[null,"　酒(1)　","　本みりん(1)　","　カレールウ\n           [えがお](10)　","","　本みりん(1)　"," "]
[null,"　塩(0.1)　","　むろ削り(2)　","⑦⑩洋風だしの素(1.5)　",null,"　塩(0.3)　"," "]
[null,"　こしょう(0.03)　","","　ソース(2.5)　",null,"　でん粉(0.6)　"," "]
[null,"","","　トマトケチャップ(2)　","","　むろ削り(4)　"," "]
[null,"","","●⑦しょうゆ(0.7)　","",""," "]
[null,"","","　純カレー(0.3)　","",""," "]
[null,"","","　塩(0.1)　","",""," "]
[null,"","","　こしょう(0.02)　","",""," "]
[null,"","","","",""," "]
["フライ缶","【ピリ辛大豆】","【あじのフリッター】","【ポテトサラダ】","【まぐろの甘辛煮】","【たことえびのから揚げ】"," "]
[null,"⑦大豆(25)　","　あじフリッター\n                    2個(40)　","　じゃがいも(40)　","　まぐろ油漬け(45)　","　たこから揚げ(25)　"," "]
[null,"⑩豚肉(25)　","　米油(4)　","⑩ポークハム(10)　","　キャベツ(12)　","△小えびのから揚げ\n                        (25)　"," "]
[null,"　たまねぎ(25)　","","　きゅうり(10)　","　しょうが(1)　","　塩(0.1)　"," "]
[null,"　にんじん(5)　","《あじフリッター》","　にんじん(5)　","　砂糖(3)　","　米油(5)　"," "]
[null,"⑦枝豆(5)　","　あじ","   卵なしマヨネーズ(6)　","●⑦しょうゆ(1.5)　",""," "]
[null,"　しょうが(0.3)　","●小麦粉","　米酢(0.5)　","　本みりん(1)　",null," "]
[null,"●⑦しょうゆ(2.5)　","△オキアミ","　砂糖(0.5)　","　酒(1)　",""," "]
[null,"　砂糖(0.6)　","●⑦調味料等","　こしょう(0.03)　","",""," "]
[null,"　酒(0.5)　",null,"","",""," "]
[null,"④ごま油(0.2)　","","《卵なしマヨネーズ》","",null," "]
[null,"⑦⑧⑩⑯中華だしの素\n                       (0.2)　","","⑦大豆粉","",""," "]
[null,"　一味唐辛子(0.03)　","","⑦粉末状植物たん白","",""," "]
[null,"　ガーリックパウダー\n　　　　　　(0.01)　","","　調味料等","",""," "]
[null,"","","","",""," "]
["あえ物・果物","【冷凍みかん】","【もやしのナムル】","","【きざみたくあん】","【きゅうりの梅和え】"," "]
[null,"　みかん 1個(120)　","　もやし(30)　","","　たくあん漬け(13)　","　きゅうり(25)　"," "]
[null,"","④白すりごま(1)　","","","　梅びしお(1.5)　"," "]
[null,"","●⑦しょうゆ(1)　","","《たくあん漬け》","●⑦しょうゆ(0.25)　"," "]
[null,"","　砂糖(0.5)　","","　大根","　砂糖(0.25)　"," "]
[null,"","　米酢(0.5)　","","●⑦調味料等",""," "]
[null,"","④ごま油(0.3)　","","","《梅びしお》"," "]
[null,null,null,null,null,"　梅"," "]
[null,null,null,null,null,"　梅肉"," "]
[null,null,null,null,null,"　赤じそ"," "]
[null,null,null,null,null,"⑬調味料等"," "]
[null,null,null,null,null,null," "]
["その他","","","","【手巻きのり】",""," "]
[null,"","","","　手巻きのり 1袋(2.5)　",""," "]
[null,"","","","",""," "]
[null,"","","","",""," "]
["　",null,null,null,null,"（　）内は純使用量　単位：グラム"," "]
[null,null,null,null,null,null," "]
[null,null,null,null,null,null," "]
[null,null,null,null,null,null," "]
[null,null,null,null,null,null," "]
[null,null,null,null,null,null," "]
[null,null,null,null,null,null," "]
[null,null,null,null,null,null," "]
["　",null,null,null,null,null," "]
["　",null,null,null,null,"小学校－３"," "]
["日","2024-06-17","2024-06-18","2024-06-19","2024-06-20","2024-06-21"," "]
["主食","麦ごはん","◎●⑦あいちの米粉パン","ごはん","ごはん","麦ごはん"," "]
["牛乳","◎牛乳","◎牛乳","◎牛乳","◎牛乳","◎牛乳"," "]
["食缶","【中華海鮮うま煮】","【大豆とチキンの\n　　　　　トマト煮】","【豚汁】","【肉じゃが】","【マーボ豆腐】"," "]
[null,"　たまねぎ(40)　","　たまねぎ(40)　","⑦豆腐(25)　","　じゃがいも(90)　","⑦豆腐(90)　"," "]
[null,"　キャベツ(35)　","⑦大豆(35)　","　さといも(20)　","　たまねぎ(40)　","　にんじん(25)　"," "]
[null,"○うずら卵(20)　","　にんじん(20)　","⑩豚肉(20)　","　こんにゃく(20)　","　たけのこ(20)　"," "]
[null,"①いか(20)　","　じゃがいも(20)　","　大根(15)　","　にんじん(20)　","⑩豚肉(20)　"," "]
[null,"△えび(20)　","　トマト(20)　","　にんじん(7)　","⑩豚肉(15)　","　ねぎ(15)　"," "]
[null,"　たけのこ(10)　","⑧鶏肉(15)　","　ごぼう(5)　","　グリンピース(4)　","　しょうが(0.5)　"," "]
[null,"　ちくわ(10)　","　とうもろこし(5)　","　ねぎ(5)　","●⑦しょうゆ(4.5)　","　にんにく(0.2)　"," "]
[null,"　にんじん(10)　","　セロリ(2)　","⑦豆みそ(9)　","　砂糖(3)　","⑦豆みそ(5)　"," "]
[null,"●⑦しょうゆ(2.5)　","　にんにく(0.3)　","　むろ削り(3)　","　本みりん(1)　","　砂糖(3)　"," "]
[null,"　野菜ブイヨン(1)　","　トマトジュース(20)　","","　塩(0.2)　","●⑦しょうゆ(2.3)　"," "]
[null,"　砂糖(1)　","　トマトケチャップ(7)　","","　こしょう(0.02)　","⑦⑧⑩⑯中華だしの素\n                        (1)　"," "]
[null,"　酒(1)　","　ソース(2)　",null,"","　本みりん(1)　"," "]
[null,"●⑦⑯オイスター\n              ソース (1)　","　砂糖(2)　",null,"","　酒(1)　"," "]
[null,"④ごま油(0.3)　","⑦⑩洋風だしの素(1)　",null,"","④ごま油(0.8)　"," "]
[null,"　塩(0.1)　","　赤ワイン(1)　",null,"","　豆板醤(0.2)　"," "]
[null,"　こしょう(0.02)　","　塩(0.4)　",null,"","　でん粉(0.8)　"," "]
[null,"　でん粉(0.8)　","　こしょう(0.05)　",null,"",""," "]
[null,"","","","",""," "]
["フライ缶","【切り干し大根サラダ】","【サボテンの\n　オリーブオイル炒め】","【めひかりフライ】","【おひたし】","【バンバンジーサラダ】"," "]
[null,"　きゅうり(10)　","⑩豚肉(30)　","●めひかりフライ \n               2尾(30)　","　もやし(25)　","　きゅうり(30)　"," "]
[null,"　まぐろ油漬け(10)　","　たまねぎ(20)　","　米油(3)　","　キャベツ(10)　","⑧サラダチキン(20)　"," "]
[null,"　とうもろこし(10)　","　ズッキーニ(15)　","","　にんじん(5)　","　キャベツ(10)　"," "]
[null,"　にんじん(5)　","　赤パプリカ(7)　",null,"　ほうれん草(5)　","　にんじん(3)　"," "]
[null,"　切り干し大根(3)　","　黄パプリカ(7)　",null,"　かまぼこ(5)　","④白ねりごま(3)　"," "]
[null,"　卵なしマヨネーズ(6)　","　うちわサボテン(3)　",null,"　しらす干し(2)　","④白すりごま(1)　"," "]
[null,"●⑦しょうゆ(1.2)　","　にんにく(0.1)",null,"④白すりごま(1)　","●⑦しょうゆ(1.8)　"," "]
[null,"④白すりごま(1)　","●⑦⑯オイスター\n              ソース (2)　","","④白ごま(1)　","　砂糖(1.5)　"," "]
[null,"　米酢(0.5)　","　酒(2)　","","●⑦しょうゆ(1.5)　","　米酢(1)　"," "]
[null,"　砂糖(0.5)　","●⑦しょうゆ(1.5)　","","　砂糖(1.2)　","④ごま油(0.5)　"," "]
[null,"　塩(0.1)　","　オリーブ油(0.5)　","","　米酢(0.6)　",""," "]
[null,"　こしょう(0.03)　","　塩(0.3)　","","",""," "]
[]
[null,"《卵なしマヨネーズ》"]
[null,"⑦大豆粉"]
[null,"⑦粉末状植物たん白"]
[null,"   調味料等"]
[null,"","","","",""," "]
["あえ物・果物",null,"","【キャベツのゆかり和え】","",""," "]
[null,null,null,null,null,null," "]
[null,null,"","　キャベツ(25)　","",""," "]
[null,null,"","　ゆかり粉(0.5)　","",""," "]
[null,null,null,null,null,null," "]
[null,"　","","","",""," "]
["その他","【ひじき佃煮】","","【愛知のみかんゼリー】","【型抜きチーズ】",""," "]
[null,"　ひじきのり佃煮\n                 1袋(10)　","","　愛知のみかんゼリー\n　　　　　　1個(60)　","◎型抜きチーズ 1個(15)　",""," "]
[null,null,null,null,null,null," "]
[null,"《ひじきのり佃煮》",null,null,null,null," "]
[null,"　のり",null,null,null,null," "]
[null,"　ひじき",null,null,null,null," "]
[null,"●⑦調味料等","","","",""," "]
[null,"","","","",""," "]
["　",null,null,null,null,"（　）内は純使用量　単位：グラム"," "]
["　",null,null,null,null,null," "]
["　",null,null,null,null,"小学校－４"," "]
["日","2024-06-24","2024-06-25","2024-06-26","2024-06-27","2024-06-28"," "]
["主食","ごはん","ごはん","玄米ごはん","わかめごはん","◎●⑦サンドイッチ\n　　　　　　ロールパン"," "]
["牛乳","◎牛乳","◎牛乳","◎牛乳","◎牛乳","◎牛乳"," "]
["食缶","【もずく汁】","【けんちん汁】","【えがおの\n　　ハヤシシチュー】","【かぼちゃ入りみそ汁】","【野菜スープ】"," "]
[null,"⑧鶏肉(20)　","⑦豆腐(20)　","　たまねぎ(40)　","　かぼちゃ(25)　","　じゃがいも(20)　"," "]
[null,"⑫ながいも(15)　","　大根(20)　","　じゃがいも(35)　","⑦豆腐(25)　","　たまねぎ(20)　"," "]
[null,"　にんじん(10)　","　こんにゃく(15)　","⑩豚肉(20)　","　にんじん(10)　","⑧鶏肉(20)　"," "]
[null,"　かまぼこ(10)　","　にんじん(10)　","　にんじん(10)　","　たまねぎ(10)　","　もやし(10)　"," "]
[null,"　えのきたけ(10)　","　ごぼう(10)　","　マッシュルーム(8)　","　えのきたけ(5)　","　エリンギ(10)　"," "]
[null,"　ねぎ(10)　","　ねぎ(10)　","　にんにく(0.3)　","　ねぎ(5)　","　にんじん(10)　"," "]
[null,"　もずく(5)　","⑦油揚げ(2)　","　ハヤシルウ\n             [えがお](10)　","⑦油揚げ(2)　","　パセリ(0.03)　"," "]
[null,"　しょうが(0.5)　","●⑦しょうゆ(4)　","　トマトピューレ(10)　","⑦豆みそ(9)　","　白ワイン(2)　"," "]
[null,"●⑦しょうゆ(4)　","④ごま油(0.5)　","　トマトケチャップ(5)　","　本みりん(0.5)　","　野菜ブイヨン(1.5)　"," "]
[null,"　酒(1)　","　塩(0.3)　","　ソース(2)　","　むろ削り(4)　","●⑦しょうゆ(0.8)　"," "]
{"$rows_left_out":43}
{"sheet":"対象者","index":1,"n_rows":101,"n_cols":21,"rows_kept":101,"cut":false,"hidden":true,"merged":[]}
["番号","学校","学年","組","氏名","アレ１","１記号","アレ２","２記号","アレ３","３記号","アレ４","４記号","アレ５","５記号","アレ６","６記号","アレ７","７記号",1,"アレルゲンはドロップダウンリストから選択してください。"]
[1,null,null,null,null,null,"---",null,"---",null,"---",null,"---",null,"---",null,"---",null,"---",2,"アレルギー献立表に表示可能なアレルゲンは５種類までとなります。※６、７は参考入力"]
[2,null,null,null,null,null,"---",null,"---",null,"---",null,"---",null,"---",null,"---",null,"---","※","５種類を超えるアレルゲンのある場合は、弁当持参を促すべき児童生徒と言えます。"]
[3,null,null,null,null,null,"---",null,"---",null,"---",null,"---",null,"---",null,"---",null,"---",3,"このリストをアレルギー献立表の「対象者」シートにコピーして「値のみ」を貼り付けてください。"]
[4,null,null,null,null,null,"---",null,"---",null,"---",null,"---",null,"---",null,"---",null,"---",4,"対象者を100人以上登録したいときは、A100～R101を選択してコピー（又はオートフィル）してください。"]
[5,null,null,null,null,null,"---",null,"---",null,"---",null,"---",null,"---",null,"---",null,"---"]
[6,null,null,null,null,null,"---",null,"---",null,"---",null,"---",null,"---",null,"---",null,"---"]
[7,null,null,null,null,null,"---",null,"---",null,"---",null,"---",null,"---",null,"---",null,"---"]
[8,null,null,null,null,null,"---",null,"---",null,"---",null,"---",null,"---",null,"---",null,"---"]
[9,null,null,null,null,null,"---",null,"---",null,"---",null,"---",null,"---",null,"---",null,"---"]
[10,null,null,null,null,null,"---",null,"---",null,"---",null,"---",null,"---",null,"---",null,"---"]
[11,null,null,null,null,null,"---",null,"---",null,"---",null,"---",null,"---",null,"---",null,"---"]
[12,null,null,null,null,null,"---",null,"---",null,"---",null,"---",null,"---",null,"---",null,"---"]
[13,null,null,null,null,null,"---",null,"---",null,"---",null,"---",null,"---",null,"---",null,"---"]
[14,null,null,null,null,null,"---",null,"---",null,"---",null,"---",null,"---",null,"---",null,"---"]
[15,null,null,null,null,null,"---",null,"---",null,"---",null,"---",null,"---",null,"---",null,"---"]
[16,null,null,null,null,null,"---",null,"---",null,"---",null,"---",null,"---",null,"---",null,"---"]
[17,null,null,null,null,null,"---",null,"---",null,"---",null,"---",null,"---",null,"---",null,"---"]
[18,null,null,null,null,null,"---",null,"---",null,"---",null,"---",null,"---",null,"---",null,"---"]
[19,null,null,null,null,null,"---",null,"---",null,"---",null,"---",null,"---",null,"---",null,"---"]
[20,null,null,null,null,null,"---",null,"---",null,"---",null,"---",null,"---",null,"---",null,"---"]
[21,null,null,null,null,null,"---",null,"---",null,"---",null,"---",null,"---",null,"---",null,"---"]
[22,null,null,null,null,null,"---",null,"---",null,"---",null,"---",null,"---",null,"---",null,"---"]
[23,null,null,null,null,null,"---",null,"---",null,"---",null,"---",null,"---",null,"---",null,"---"]
[24,null,null,null,null,null,"---",null,"---",null,"---",null,"---",null,"---",null,"---",null,"---"]
[25,null,null,null,null,null,"---",null,"---",null,"---",null,"---",null,"---",null,"---",null,"---"]
[26,null,null,null,null,null,"---",null,"---",null,"---",null,"---",null,"---",null,"---",null,"---"]
[27,null,null,null,null,null,"---",null,"---",null,"---",null,"---",null,"---",null,"---",null,"---"]
[28,null,null,null,null,null,"---",null,"---",null,"---",null,"---",null,"---",null,"---",null,"---"]
[29,null,null,null,null,null,"---",null,"---",null,"---",null,"---",null,"---",null,"---",null,"---"]
[30,null,null,null,null,null,"---",null,"---",null,"---",null,"---",null,"---",null,"---",null,"---"]
[31,null,null,null,null,null,"---",null,"---",null,"---",null,"---",null,"---",null,"---",null,"---"]
[32,null,null,null,null,null,"---",null,"---",null,"---",null,"---",null,"---",null,"---",null,"---"]
[33,null,null,null,null,null,"---",null,"---",null,"---",null,"---",null,"---",null,"---",null,"---"]
[34,null,null,null,null,null,"---",null,"---",null,"---",null,"---",null,"---",null,"---",null,"---"]
[35,null,null,null,null,null,"---",null,"---",null,"---",null,"---",null,"---",null,"---",null,"---"]
[36,null,null,null,null,null,"---",null,"---",null,"---",null,"---",null,"---",null,"---",null,"---"]
[37,null,null,null,null,null,"---",null,"---",null,"---",null,"---",null,"---",null,"---",null,"---"]
[38,null,null,null,null,null,"---",null,"---",null,"---",null,"---",null,"---",null,"---",null,"---"]
[39,null,null,null,null,null,"---",null,"---",null,"---",null,"---",null,"---",null,"---",null,"---"]
[40,null,null,null,null,null,"---",null,"---",null,"---",null,"---",null,"---",null,"---",null,"---"]
[41,null,null,null,null,null,"---",null,"---",null,"---",null,"---",null,"---",null,"---",null,"---"]
[42,null,null,null,null,null,"---",null,"---",null,"---",null,"---",null,"---",null,"---",null,"---"]
[43,null,null,null,null,null,"---",null,"---",null,"---",null,"---",null,"---",null,"---",null,"---"]
[44,null,null,null,null,null,"---",null,"---",null,"---",null,"---",null,"---",null,"---",null,"---"]
[45,null,null,null,null,null,"---",null,"---",null,"---",null,"---",null,"---",null,"---",null,"---"]
[46,null,null,null,null,null,"---",null,"---",null,"---",null,"---",null,"---",null,"---",null,"---"]
[47,null,null,null,null,null,"---",null,"---",null,"---",null,"---",null,"---",null,"---",null,"---"]
[48,null,null,null,null,null,"---",null,"---",null,"---",null,"---",null,"---",null,"---",null,"---"]
[49,null,null,null,null,null,"---",null,"---",null,"---",null,"---",null,"---",null,"---",null,"---"]
[50,null,null,null,null,null,"---",null,"---",null,"---",null,"---",null,"---",null,"---",null,"---"]
[51,null,null,null,null,null,"---",null,"---",null,"---",null,"---",null,"---",null,"---",null,"---"]
[52,null,null,null,null,null,"---",null,"---",null,"---",null,"---",null,"---",null,"---",null,"---"]
[53,null,null,null,null,null,"---",null,"---",null,"---",null,"---",null,"---",null,"---",null,"---"]
[54,null,null,null,null,null,"---",null,"---",null,"---",null,"---",null,"---",null,"---",null,"---"]
[55,null,null,null,null,null,"---",null,"---",null,"---",null,"---",null,"---",null,"---",null,"---"]
[56,null,null,null,null,null,"---",null,"---",null,"---",null,"---",null,"---",null,"---",null,"---"]
[57,null,null,null,null,null,"---",null,"---",null,"---",null,"---",null,"---",null,"---",null,"---"]
[58,null,null,null,null,null,"---",null,"---",null,"---",null,"---",null,"---",null,"---",null,"---"]
[59,null,null,null,null,null,"---",null,"---",null,"---",null,"---",null,"---",null,"---",null,"---"]
[60,null,null,null,null,null,"---",null,"---",null,"---",null,"---",null,"---",null,"---",null,"---"]
[61,null,null,null,null,null,"---",null,"---",null,"---",null,"---",null,"---",null,"---",null,"---"]
[62,null,null,null,null,null,"---",null,"---",null,"---",null,"---",null,"---",null,"---",null,"---"]
[63,null,null,null,null,null,"---",null,"---",null,"---",null,"---",null,"---",null,"---",null,"---"]
[64,null,null,null,null,null,"---",null,"---",null,"---",null,"---",null,"---",null,"---",null,"---"]
[65,null,null,null,null,null,"---",null,"---",null,"---",null,"---",null,"---",null,"---",null,"---"]
[66,null,null,null,null,null,"---",null,"---",null,"---",null,"---",null,"---",null,"---",null,"---"]
[67,null,null,null,null,null,"---",null,"---",null,"---",null,"---",null,"---",null,"---",null,"---"]
[68,null,null,null,null,null,"---",null,"---",null,"---",null,"---",null,"---",null,"---",null,"---"]
[69,null,null,null,null,null,"---",null,"---",null,"---",null,"---",null,"---",null,"---",null,"---"]
[70,null,null,null,null,null,"---",null,"---",null,"---",null,"---",null,"---",null,"---",null,"---"]
[71,null,null,null,null,null,"---",null,"---",null,"---",null,"---",null,"---",null,"---",null,"---"]
[72,null,null,null,null,null,"---",null,"---",null,"---",null,"---",null,"---",null,"---",null,"---"]
[73,null,null,null,null,null,"---",null,"---",null,"---",null,"---",null,"---",null,"---",null,"---"]
[74,null,null,null,null,null,"---",null,"---",null,"---",null,"---",null,"---",null,"---",null,"---"]
[75,null,null,null,null,null,"---",null,"---",null,"---",null,"---",null,"---",null,"---",null,"---"]
[76,null,null,null,null,null,"---",null,"---",null,"---",null,"---",null,"---",null,"---",null,"---"]
[77,null,null,null,null,null,"---",null,"---",null,"---",null,"---",null,"---",null,"---",null,"---"]
[78,null,null,null,null,null,"---",null,"---",null,"---",null,"---",null,"---",null,"---",null,"---"]
[79,null,null,null,null,null,"---",null,"---",null,"---",null,"---",null,"---",null,"---",null,"---"]
[80,null,null,null,null,null,"---",null,"---",null,"---",null,"---",null,"---",null,"---",null,"---"]
[81,null,null,null,null,null,"---",null,"---",null,"---",null,"---",null,"---",null,"---",null,"---"]
[82,null,null,null,null,null,"---",null,"---",null,"---",null,"---",null,"---",null,"---",null,"---"]
[83,null,null,null,null,null,"---",null,"---",null,"---",null,"---",null,"---",null,"---",null,"---"]
[84,null,null,null,null,null,"---",null,"---",null,"---",null,"---",null,"---",null,"---",null,"---"]
[85,null,null,null,null,null,"---",null,"---",null,"---",null,"---",null,"---",null,"---",null,"---"]
[86,null,null,null,null,null,"---",null,"---",null,"---",null,"---",null,"---",null,"---",null,"---"]
[87,null,null,null,null,null,"---",null,"---",null,"---",null,"---",null,"---",null,"---",null,"---"]
[88,null,null,null,null,null,"---",null,"---",null,"---",null,"---",null,"---",null,"---",null,"---"]
[89,null,null,null,null,null,"---",null,"---",null,"---",null,"---",null,"---",null,"---",null,"---"]
[90,null,null,null,null,null,"---",null,"---",null,"---",null,"---",null,"---",null,"---",null,"---"]
[91,null,null,null,null,null,"---",null,"---",null,"---",null,"---",null,"---",null,"---",null,"---"]
[92,null,null,null,null,null,"---",null,"---",null,"---",null,"---",null,"---",null,"---",null,"---"]
[93,null,null,null,null,null,"---",null,"---",null,"---",null,"---",null,"---",null,"---",null,"---"]
[94,null,null,null,null,null,"---",null,"---",null,"---",null,"---",null,"---",null,"---",null,"---"]
[95,null,null,null,null,null,"---",null,"---",null,"---",null,"---",null,"---",null,"---",null,"---"]
[96,null,null,null,null,null,"---",null,"---",null,"---",null,"---",null,"---",null,"---",null,"---"]
[97,null,null,null,null,null,"---",null,"---",null,"---",null,"---",null,"---",null,"---",null,"---"]
[98,null,null,null,null,null,"---",null,"---",null,"---",null,"---",null,"---",null,"---",null,"---"]
[99,null,null,null,null,null,"---",null,"---",null,"---",null,"---",null,"---",null,"---",null,"---"]
[100,null,null,null,null,null,"---",null,"---",null,"---",null,"---",null,"---",null,"---",null,"---"]

{"sheet":"アレルゲン","index":2,"n_rows":5,"n_cols":4,"rows_kept":5,"cut":false,"hidden":true,"merged":[]}
[1,{"$f":"VLOOKUP(D$1,対象者!$A:$S,7,FALSE)","v":{"$error":"#N/A"}},"個人番号",{"$f":"'アレルギー献立表(小)'!H3","v":0}]
[2,{"$f":"VLOOKUP(D$1,対象者!$A:$S,9,FALSE)","v":{"$error":"#N/A"}}]
[3,{"$f":"VLOOKUP(D$1,対象者!$A:$S,11,FALSE)","v":{"$error":"#N/A"}}]
[4,{"$f":"VLOOKUP(D$1,対象者!$A:$S,13,FALSE)","v":{"$error":"#N/A"}}]
[5,{"$f":"VLOOKUP(D$1,対象者!$A:$S,15,FALSE)","v":{"$error":"#N/A"}}]