{"text_format":"1","workbook":"xlsx","n_sheets":3,"sheets":["アレルギー献立表 ","対象者","アレルゲン"],"not_rendered":{"charts":0,"images":1,"macros":1,"external_links":5,"defined_names":1,"comments":0,"pivot_tables":0},"unopened":[],"bounds":{"document_bytes":16777216,"sheet_cells":100000,"rows_first":2000,"rows_last":500,"rows_between":2000,"halvings":0,"cell_chars":16384,"cell_head_chars":4096},"cells_cut":0,"cells_raw":0,"read":"whole","date_system":"1900"}

{"sheet":"アレルギー献立表 ","index":0,"n_rows":178,"n_cols":8,"rows_kept":178,"cut":false,"hidden":false,"merged":[[164,0,175,0],[6,0,19,0],[20,0,34,0],[35,0,42,0],[44,0,47,0],[62,0,80,0],[81,0,95,0],[96,0,102,0],[103,0,106,0],[119,0,139,0],[140,0,150,0],[151,0,163,0],[204,0,207,0],[208,0,211,0],[182,0,183,0],[184,0,185,0],[186,0,189,0],[190,0,193,0],[200,0,201,0],[202,0,203,0]]}
[null,{"$f":"CONCATENATE(IFERROR(VLOOKUP($H$3,対象者!$A:$O,2,FALSE),\"\"),DBCS(IFERROR(VLOOKUP($H$3,対象者!$A:$O,3,FALSE),\"\")),IFERROR(IF($H$3=\"\",\"\",\"年\"),\"\"))","v":""},{"$f":"IFERROR(VLOOKUP($H$3,対象者!$A:$O,4,FALSE),\"\")","v":""},{"$f":"IFERROR(VLOOKUP($H$3,対象者!$A:$O,5,FALSE),\"\")","v":""},null,null," "]
[null,{"$f":"CONCATENATE(IFERROR(VLOOKUP($H$3,対象者!$A:$O,6,FALSE),\"\"),\" \",IFERROR(VLOOKUP($H$3,対象者!$A:$O,7,FALSE),\"\"))","v":" "},{"$f":"CONCATENATE(IFERROR(VLOOKUP($H$3,対象者!$A:$O,8,FALSE),\"\"),\" \",IFERROR(VLOOKUP($H$3,対象者!$A:$O,9,FALSE),\"\"))","v":" "},{"$f":"CONCATENATE(IFERROR(VLOOKUP($H$3,対象者!$A:$O,10,FALSE),\"\"),\" \",IFERROR(VLOOKUP($H$3,対象者!$A:$O,11,FALSE),\"\"))","v":" "},{"$f":"CONCATENATE(IFERROR(VLOOKUP($H$3,対象者!$A:$O,12,FALSE),\"\"),\" \",IFERROR(VLOOKUP($H$3,対象者!$A:$O,13,FALSE),\"\"))","v":" "},{"$f":"CONCATENATE(IFERROR(VLOOKUP($H$3,対象者!$A:$O,14,FALSE),\"\"),\" \",IFERROR(VLOOKUP($H$3,対象者!$A:$O,15,FALSE),\"\"))","v":" "}," ","番号"]
["　","令和６年度　７月アレルギー献立表",null,null,null,"中学校－１"," "]
["日","2024-07-01","2024-07-02","2024-07-03","2024-07-04","2024-07-05"," "]
["主食","麦ごはん","ごはん","わかめごはん","◎●⑦クロス\n　　　　ロールパン","麦ごはん"," "]
["牛乳","◎牛乳","◎牛乳","◎牛乳","◎はっこう乳","◎牛乳"," "]
["食缶","【トックスープ】","【かきたま汁】","【肉じゃが】","【パンプキン\n　　ポタージュ】","【七夕汁】"," "]
[null,"　たまねぎ(32.5)　","⑦豆腐(32.5)　","　じゃがいも(117)　","　たまねぎ(52)　","　とうがん(39)　"," "]
[null,"　トック(26)　","○液卵(26)　","　たまねぎ(52)　","　かぼちゃ(32.5)　","　にんじん(13)　"," "]
[null,"⑧鶏肉(19.5)　","⑧鶏肉(19.5)　","　こんにゃく(26)　","　にんじん(13)　","　オクラ(10.4)　"," "]
[null,"　にんじん(13)　","　たまねぎ(19.5)　","　にんじん(26)　","　かぼちゃ\n　　ペースト(10.4)　","　星型かまぼこ(10.4)　"," "]
[null,"　たけのこ(10.4)　","　かまぼこ(13)　","⑩豚肉(19.5)　","⑧鶏肉(13)　","●サボテン\n　　きしめん(5.2)　"," "]
[null,"　チンゲンサイ(10.4)　","　にんじん(6.5)　","　グリンピース(5.2)　","　マッシュルーム(13)　","　しいたけ(0.65)　"," "]
[null,"　とうもろこし(6.5)　","　えのきたけ(6.5)　","●⑦しょうゆ(5.85)　","◎牛乳(39)　","●⑦うす口\n　　　しょうゆ(5.2)　"," "]
[null,"⑧⑩中華ガラスープ\n　　　　　の素(4.55)　","　みつば(3.9)　","　砂糖(3.9)　","　ホワイトルウ\n　　　　[えがお](6.5)　","　本みりん(1.3)　"," "]
[null,"●⑦しょうゆ(1.56)　","●⑦しょうゆ(5.2)　","　本みりん(1.3)　","◎脱脂粉乳(2.6)　","　塩(0.26)　"," "]
[null,"　酒(1.3)　","　塩(0.39)　","　塩(0.26)　","⑦⑩洋風だしの素(1.3)　","　むろ削り(5.2)　"," "]
[null,"　塩(0.13)　","　でん粉(1.3)　","　こしょう(0.03)　","　塩(0.65)　",""," "]
[null,"　こしょう(0.04)　","　むろ削り(3.9)　","","　こしょう(0.05)　",""," "]
[null,"","","","",""," "]
["フライ缶","【揚げえび\n　　　しゅうまい】","【なす入り肉みそ\n　　ひじき丼の具】","【かつおと大豆の\n　レモンじょうゆ和え】","【キャベツと\n　ウインナーのソテー】","【ハンバーグの\n　　おろしだれかけ】"," "]
[null,"　えび入りしゅうまい\n　　　　　　 3個(54)　","　たまねぎ(39)　","　かつお打ち粉付き\n　　　　　　　　(52)　","　キャベツ(39)　","　ハンバーグ 1個(60)　"," "]
[null,"　米油(5.4)　","⑩豚肉(39)　","⑦大豆(19.5)　","⑩ポーク\n　　ウインナー(26)　","　米油(1.3)　"," "]
[null,"","　なす(10.4)　","　でん粉(3.9)　","　ピーマン(6.5)　","　大根おろし(13)　"," "]
[null,"《えび入り\n　　　　しゅうまい》","　にんじん(10.4)　","　米油(7.54)　","　にんじん(6.5)　","●⑦しょうゆ(3.9)　"," "]
[null,"　すけとうだら","　米ひじき(1.82)　","　砂糖(2.6)　","　とうもろこし(6.5)　","　砂糖(2.6)　"," "]
[null,"△えび","　しょうが(1.3)　","　レモン果汁(1.95)　","　米油(0.65)　","　本みりん(1.3)　"," "]
[null,"　たまねぎ　","⑦豆みそ(5.2)　","●⑦しょうゆ(1.3)　","　塩(0.26)　",""," "]
[null,"　でん粉","　砂糖(3.25)　",null,"　こしょう(0.03)　","《ハンバーグ》"," "]
[null,"⑦粒状大豆たん白","　酒(2.6)　",null,"","⑧鶏肉"," "]
[null,"●小麦粉","　本みりん(1.95)　","","","⑩豚肉"," "]
[null,"⑩⑯調味料等","●⑦しょうゆ(1.3)　","","","　たまねぎ"," "]
[null,null,"　でん粉(0.65)　",null,null,"　でん紛"," "]
[null,null,null,"","","⑩調味料等"," "]
[null,"","","","",""," "]
["あえ物・果物","【もやしのナムル】","【冷凍みかん】","","","【きゅうりの\n　　塩昆布あえ】"," "]
[null,"　もやし(39)　","　みかん 1個(120)　","","","　きゅうり(32.5)　"," "]
[null,"④白すりごま(1.3)　","","","","　にんじん(3.9)　"," "]
[null,"●⑦しょうゆ(1.3)　","","","","　塩昆布(1.56)　"," "]
[null,"　砂糖(0.65)　","","","",""," "]
[null,"　米酢(0.65)　","","","","《塩昆布》"," "]
[null,"④ごま油(0.39)　","","","","　昆布"," "]
[null,"","","","","●⑦調味料等"," "]
[null,null,null,null,null,null," "]
["その他","【いわしの干し小魚】","","","","【フローズン\n　　ヨーグルト】"," "]
[null,"　いわしの干し小魚\n　　　　　　 １袋(5)　","","","","◎ヨーグルト 1個(60)　"," "]
[null,"","","","",""," "]
[null,"","","","",""," "]
["　",null,null,null,null,"（　）内は純使用量　単位：グラム"," "]
["※","アレルギー物質の21品目について、次のように表示しています。",null,null,null,null," "]
["　","○…卵","◎…乳","●…小麦","△…えび","▲…かに"," "]
["　","①…いか","②…オレンジ","③…牛肉","④…ごま","⑤…さけ"," "]
["　","⑥…さば","⑦…大豆","⑧…鶏肉","⑨…バナナ","⑩…豚肉"," "]
["　","⑪…もも","⑫…やまいも","⑬…りんご","⑭…ゼラチン",null," "]
["　","⑮…種実（ぎんなん・くり・ココナッツ）",null,null,"⑯…貝（あさり・ほたて等）",null," "]
["１","パンに表示される⑦大豆については、添加物のレシチンに含まれる微量のアレルゲンを示します。",null,null,null,null," "]
["２","アレルギー献立表の見方については、「保存版ＮＯ．１」を参照してください。",null,null,null,null," "]
["　",null,null,null,null,null," "]
["　",null,null,null,null,"中学校－２"," "]
["日","2024-07-08","2024-07-09","2024-07-10","2024-07-11","2024-07-12"," "]
["主食","ごはん","麦ごはん","ごはん","◎●⑦ミルク\n　　　　ロールパン","ごはん"," "]
["牛乳","◎牛乳","◎牛乳","◎牛乳","◎牛乳","◎牛乳"," "]
["食缶","【スタミナ汁】","【サボテン\n　　　キーマカレー】","【もずく入り五目汁】","【大豆とウインナーの\n　　　　　トマト煮】","【ジャーチャン\n　　　　　ドウフ】"," "]
[null,"⑦豆腐(39)　","　たまねぎ(78)　","　じゃがいも(26)　","　たまねぎ(45.5)　","⑦生揚げ(52)　"," "]
[null,"　じゃがいも(26)　","⑩豚肉(39)　","⑧鶏肉(26)　","⑦大豆(45.5)　","　たまねぎ(52)　"," "]
[null,"　たまねぎ(19.5)　","　にんじん(32.5)　","　大根(26)　","　じゃがいも(26)　","⑩豚肉(32.5)　"," "]
[null,"⑩豚肉(19.5)　","　トマト(13)　","　かまぼこ(13)　","　トマト(19.5)　","　にんじん(19.5)　"," "]
[null,"　ねぎ(10.4)　","　マッシュルーム(10.4)　","　ごぼう(6.5)　","⑩ポークウインナー\n　　　　　　(19.5)　","　ねぎ(9.1)　"," "]
[null,"　にんじん(6.5)　","　とうもろこし(6.5)　","　にんじん(6.5)　","　にんじん(13)　","　しいたけ(0.65)　"," "]
[null,"⑦油揚げ(3.9)　","　うちわサボテン(3.9)　","　もずく(6.5)　","　ズッキーニ(10.4)　","　しょうが(0.65)　"," "]
[null,"　にんにく(0.26)　","　カレールウ\n　　　　[えがお](13)　","　ねぎ(6.5)　","　セロリ(2.6)　","●⑦しょうゆ(6.5)　"," "]
[null,"⑦合わせみそ(11.7)　","⑦⑩洋風だしの素\n　　　　　　　(1.95)　","●⑦しょうゆ(5.2)　","　にんにく(0.39)　","⑦豆みそ(3.25)　"," "]
[null,"　むろ削り(3.9)　","　純カレー(0.39)　","　本みりん(1.3)　","　トマトジュース(13)　","　砂糖(2.6)　"," "]
[null,"","　塩(0.39)　","　塩(0.13)　","　トマトケチャップ\n　　　　　　　(9.1)　","　豆板醤(0.13)　"," "]
[null,"","　こしょう(0.03)　","　和風だしの素(1.3)　","　ソース(2.6)　","　でん粉(1.3)　"," "]
[null,"","","","　砂糖(1.3)　",""," "]
[null,"","","","⑦⑩洋風だしの素\n　　　　　　　(1.3)　",""," "]
[null,"","","","　赤ワイン(1.3)　",""," "]
[null,"","","","　塩(0.52)　",""," "]
[null,"","","","　こしょう(0.05)　",""," "]
[null,"","","","",""," "]
["フライ缶","【まぐろの甘辛煮】","【シャキシャキ\n　　　ポテトサラダ】","【ゴーヤ\n　　チャンプルー】","【ツナサラダ】","【さけ団子の\n　　　甘酢あん】"," "]
[null,"　まぐろ油漬け(58.5)　","　じゃがいも(52)　","⑦生揚げ(32.5)　","　キャベツ(26)　","⑤さけ団子(39)　"," "]
[null,"　キャベツ(15.6)　","　まぐろ油漬け(13)　","○炒り卵(26)　","　きゅうり(26)　","　米油(3.9)　"," "]
[null,"　しょうが(1.3)　","　きゅうり(10.4)　","　ゴーヤ(19.5)　","　まぐろ油漬け(13)　","　たまねぎ(26)　"," "]
[null,"　砂糖(3.9)　","　キャベツ(10.4)　","⑩豚肉(19.5)　","　とうもろこし(6.5)　","　にんじん(13)　"," "]
[null,"●⑦しょうゆ(1.95)　","　卵なしマヨネーズ\n　　　　　　　(7.8)　","●⑦しょうゆ(2.6)　","　にんじん(3.9)　","　たけのこ(13)　"," "]
[null,"　本みりん(1.3)　","　米酢(0.65)　","　砂糖(2.6)　","　砂糖(1.3)　","　黄パプリカ(10.4)　"," "]
[null,"　酒(1.3)　","　塩(0.06)　","⑦⑧⑩⑯中華だしの素\n　　　　　　(0.65)　","　ワインビネガー(1.3)　","　トマトケチャップ\n　　　　　　(3.25)　"," "]
[null,"","　こしょう(0.01)　","　塩(0.13)　","●⑦しょうゆ(1.04)　","●⑦しょうゆ(1.95)　"," "]
[null,"","","　こしょう(0.04)　","　オリーブ油(0.65)　","　砂糖(1.95)　"," "]
[null,null,"《卵なしマヨネーズ》","　米油(0.39)　","　塩(0.13)　","　米酢(1.3)　"," "]
[null,null,"⑦大豆粉",null,"　こしょう(0.03)　","　でん粉(0.65)　"," "]
[null,"","⑦粉末状植物性たん白",null,null,null," "]
[null,"","　調味料等",null,null,null," "]
[null,"","","","",""," "]
["あえ物・果物","【きざみたくあん】","","","【冷凍パイナップル】",""," "]
[null,"　たくあん漬け(16.9)　","","","　パイナップル\n　　　　　　1個(40)　",""," "]
[null,null,null,null,null,null," "]
[null,"《たくあん漬け》","","","",""," "]
[null,"　大根",null,null,null,null," "]
[null,"●⑦調味料等",null,null,null,null," "]
[null,"","","","",""," "]
["その他","【手巻きのり】","","【豆乳ココアプリン】","","【プルーン】"," "]
[null,"　のり 1袋(3)　","","⑦豆乳ココアプリン 　\n　　　　　　1個(50)　","","　プルーン 1袋(20)　"," "]
[null,"","","","",""," "]
[null,"","","","",""," "]
["　",null,null,null,null,"（　）内は純使用量　単位：グラム"," "]
[null,null,null,null,null,null," "]
[null,null,null,null,null,null," "]
[null,null,null,null,null,null," "]
[null,null,null,null,null,null," "]
[null,null,null,null,null,null," "]
[null,null,null,null,null,null," "]
["　",null,null,null,null,null," "]
["　",null,null,null,null,"中学校－３"," "]
["日","2024-07-16","2024-07-17","2024-07-18",null,null," "]
["主食","麦ごはん","ごはん","ごはん","",""," "]
["牛乳","◎牛乳","◎牛乳","◎牛乳","",""," "]
["食缶","【牛丼の具】","【卵とじ】","【ハッシュドビーフ】","",""," "]
[null,"　たまねぎ(84.5)　","○液卵(52)　","　たまねぎ(65)　","",""," "]
[null,"　しらたき(39)　","　じゃがいも(45.5)　","③牛肉(39)　","",""," "]
[null,"③牛肉(32.5)　","　たまねぎ(39)　","　にんじん(19.5)　","",""," "]
[null,"⑦焼き豆腐(26)　","⑧鶏肉(26)　","　グリンピース(5.2)　","",""," "]
[null,"　ねぎ(19.5)　","　にんじん(13)　","　にんにく(0.39)　","",""," "]
[null,"　にんじん(13)　","　さやいんげん(6.5)　","　ハヤシルウ[えがお]\n　　　　　　　(15.6)　","",""," "]
[null,"　エリンギ(13)　","●⑦しょうゆ(5.46)　","　トマトピューレ(13)　","",""," "]
[null,"●⑦しょうゆ(7.8)　","　砂糖(2.08)　","　デミグラスソース\n　　　　　　　(7.8)　","",""," "]
[null,"　砂糖(3.25)　","　本みりん(1.3)　","　トマトケチャップ\n　　　　　　　(6.5)　","",""," "]
[null,"　酒(2.6)　","　和風だしの素(1.3)　","　赤ワイン(1.3)　","",""," "]
[null,"","","⑦⑩洋風だしの素\n　　　　　　　(0.65)　","",""," "]
[null,"","","　塩(0.39)　","",""," "]
[null,"","","　砂糖(0.26)　","",""," "]
[null,"","","　こしょう(0.04)　","",""," "]
[null,null,null,null,null,null," "]
[null,null,null,"《デミグラスソース》",null,null," "]
[null,null,null,"●小麦粉",null,null," "]
[null,null,null,"　トマト",null,null," "]
[null,null,null,"⑧⑩調味料等",null,null," "]
[null,"","","","",""," "]
["フライ缶","【ちくわの\n　　いそべ揚げ】","【さばのみそ煮】","【枝豆コロッケ】","",""," "]
[null,"　ちくわ 3個(60)　","　さばのみそ煮\n　　　　　1個(60)　","　枝豆コロッケ\n　　　　　1個(60)　","",""," "]
[null,"●小麦粉(3.9)　","","　米油(6)　","",""," "]
[null,"　でん粉(1.3)　","《さばのみそ煮》","","",""," "]
[null,"　青のり粉(0.16)　","⑥さば","《枝豆コロッケ》","",""," "]
[null,"　米油(6.54)　","⑦調味料等","⑦枝豆","",""," "]
[null,null,null,"　じゃがいも",null,null," "]
[null,null,null,"●パン粉",null,null," "]
[null,null,null,"●小麦粉",null,null," "]
[null,null,null,"⑦植物性たん白",null,null," "]
[null,"","","","",""," "]
["あえ物・果物","【えだ豆】","【きゅうりの\n　　　　梅ごま和え】","【キャベツの\n　　　　サワー漬け】","",""," "]
[null,"⑦枝豆(15.6)　","　きゅうり(26)　","　キャベツ(39)　","",""," "]
[null,null,"　梅びしお(1.95)　","●⑦しょうゆ(1.3)　",null,""," "]
[null,"","④白ごま(1.3)　","　ワインビネガー(1.3)　","",""," "]
[null,"","●⑦しょうゆ(0.33)　","　砂糖(0.65)　","",""," "]
[null,"","　砂糖(0.33)　","","",""," "]
[null,null,null,null,null,null," "]
[null,null,"《梅びしお》",null,null,null," "]
[null,null,"　梅",null,null,null," "]
[null,null,"　梅肉",null,null,null," "]
[null,null,"　赤じそ",null,null,null," "]
[null,null,"⑬調味料等",null,null,null," "]
[null,"","","","",""," "]
["その他","","","【セレクトデザート】","",""," "]
[null,"","","　ミニチョコたい焼き\n　　　　　   1個(27)　","",""," "]
[null,null,null,null,null,null," "]
[null,null,null,"《ミニチョコたい焼き》",null,null," "]
[null,null,null,"●小麦粉",null,null," "]
[null,null,null,"○鶏卵",null,null," "]
[null,null,null,"◎全粉乳",null,null," "]
[null,null,null,"◎生クリーム",null,null," "]
[null,null,null,"◎⑦調味料等",null,null," "]
[null,null,null,null,null,null," "]
[null,null,null,"　アセロラゼリー\n　　　　　　1個(40)",null,null," "]
[null,"","","","",""," "]
["　",null,null,"（　）内は純使用量　単位：グラム",null,null," "]
["　"]

{"sheet":"対象者","index":1,"n_rows":101,"n_cols":21,"rows_kept":101,"cut":false,"hidden":true,"merged":[]}
["番号","学校","学年","組","氏名","アレ１","１記号","アレ２","２記号","アレ３","３記号","アレ４","４記号","アレ５","５記号","アレ６","６記号","アレ７","７記号",1,"アレルゲンはドロップダウンリストから選択してください。"]
[1,null,null,null,null,null,"---",null,"---",null,"---",null,"---",null,"---",null,"---",null,"---",2,"アレルギー献立表に表示可能なアレルゲンは５種類までとなります。※６、７は参考入力"]
[2,null,null,null,null,null,"---",null,"---",null,"---",null,"---",null,"---",null,"---",null,"---","※","５種類を超えるアレルゲンのある場合は、弁当持参を促すべき児童生徒と言えます。"]
[3,null,null,null,null,null,"---",null,"---",null,"---",null,"---",null,"---",null,"---",null,"---",3,"このリストをアレルギー献立表の「対象者」シートにコピーして「値のみ」を貼り付けてください。"]
[4,null,null,null,null,null,"---",null,"---",null,"---",null,"---",null,"---",null,"---",null,"---",4,"対象者を100人以上登録したいときは、A100～R101を選択してコピー（又はオートフィル）してください。"]
[5,null,null,null,null,null,"---",null,"---",null,"---",null,"---",null,"---",null,"---",null,"---"]
[6,null,null,null,null,null,"---",null,"---",null,"---",null,"---",null,"---",null,"---",null,"---"]
[7,null,null,null,null,null,"---",null,"---",null,"---",null,"---",null,"---",null,"---",null,"---"]
[8,null,null,null,null,null,"---",null,"---",null,"---",null,"---",null,"---",null,"---",null,"---"]
[9,null,null,null,null,null,"---",null,"---",null,"---",null,"---",null,"---",null,"---",null,"---"]
[10,null,null,null,null,null,"---",null,"---",null,"---",null,"---",null,"---",null,"---",null,"---"]
[11,null,null,null,null,null,"---",null,"---",null,"---",null,"---",null,"---",null,"---",null,"---"]
[12,null,null,null,null,null,"---",null,"---",null,"---",null,"---",null,"---",null,"---",null,"---"]
[13,null,null,null,null,null,"---",null,"---",null,"---",null,"---",null,"---",null,"---",null,"---"]
[14,null,null,null,null,null,"---",null,"---",null,"---",null,"---",null,"---",null,"---",null,"---"]
[15,null,null,null,null,null,"---",null,"---",null,"---",null,"---",null,"---",null,"---",null,"---"]
[16,null,null,null,null,null,"---",null,"---",null,"---",null,"---",null,"---",null,"---",null,"---"]
[17,null,null,null,null,null,"---",null,"---",null,"---",null,"---",null,"---",null,"---",null,"---"]
[18,null,null,null,null,null,"---",null,"---",null,"---",null,"---",null,"---",null,"---",null,"---"]
[19,null,null,null,null,null,"---",null,"---",null,"---",null,"---",null,"---",null,"---",null,"---"]
[20,null,null,null,null,null,"---",null,"---",null,"---",null,"---",null,"---",null,"---",null,"---"]
[21,null,null,null,null,null,"---",null,"---",null,"---",null,"---",null,"---",null,"---",null,"---"]
[22,null,null,null,null,null,"---",null,"---",null,"---",null,"---",null,"---",null,"---",null,"---"]
[23,null,null,null,null,null,"---",null,"---",null,"---",null,"---",null,"---",null,"---",null,"---"]
[24,null,null,null,null,null,"---",null,"---",null,"---",null,"---",null,"---",null,"---",null,"---"]
[25,null,null,null,null,null,"---",null,"---",null,"---",null,"---",null,"---",null,"---",null,"---"]
[26,null,null,null,null,null,"---",null,"---",null,"---",null,"---",null,"---",null,"---",null,"---"]
[27,null,null,null,null,null,"---",null,"---",null,"---",null,"---",null,"---",null,"---",null,"---"]
[28,null,null,null,null,null,"---",null,"---",null,"---",null,"---",null,"---",null,"---",null,"---"]
[29,null,null,null,null,null,"---",null,"---",null,"---",null,"---",null,"---",null,"---",null,"---"]
[30,null,null,null,null,null,"---",null,"---",null,"---",null,"---",null,"---",null,"---",null,"---"]
[31,null,null,null,null,null,"---",null,"---",null,"---",null,"---",null,"---",null,"---",null,"---"]
[32,null,null,null,null,null,"---",null,"---",null,"---",null,"---",null,"---",null,"---",null,"---"]
[33,null,null,null,null,null,"---",null,"---",null,"---",null,"---",null,"---",null,"---",null,"---"]
[34,null,null,null,null,null,"---",null,"---",null,"---",null,"---",null,"---",null,"---",null,"---"]
[35,null,null,null,null,null,"---",null,"---",null,"---",null,"---",null,"---",null,"---",null,"---"]
[36,null,null,null,null,null,"---",null,"---",null,"---",null,"---",null,"---",null,"---",null,"---"]
[37,null,null,null,null,null,"---",null,"---",null,"---",null,"---",null,"---",null,"---",null,"---"]
[38,null,null,null,null,null,"---",null,"---",null,"---",null,"---",null,"---",null,"---",null,"---"]
[39,null,null,null,null,null,"---",null,"---",null,"---",null,"---",null,"---",null,"---",null,"---"]
[40,null,null,null,null,null,"---",null,"---",null,"---",null,"---",null,"---",null,"---",null,"---"]
[41,null,null,null,null,null,"---",null,"---",null,"---",null,"---",null,"---",null,"---",null,"---"]
[42,null,null,null,null,null,"---",null,"---",null,"---",null,"---",null,"---",null,"---",null,"---"]
[43,null,null,null,null,null,"---",null,"---",null,"---",null,"---",null,"---",null,"---",null,"---"]
[44,null,null,null,null,null,"---",null,"---",null,"---",null,"---",null,"---",null,"---",null,"---"]
[45,null,null,null,null,null,"---",null,"---",null,"---",null,"---",null,"---",null,"---",null,"---"]
[46,null,null,null,null,null,"---",null,"---",null,"---",null,"---",null,"---",null,"---",null,"---"]
[47,null,null,null,null,null,"---",null,"---",null,"---",null,"---",null,"---",null,"---",null,"---"]
[48,null,null,null,null,null,"---",null,"---",null,"---",null,"---",null,"---",null,"---",null,"---"]
[49,null,null,null,null,null,"---",null,"---",null,"---",null,"---",null,"---",null,"---",null,"---"]
[50,null,null,null,null,null,"---",null,"---",null,"---",null,"---",null,"---",null,"---",null,"---"]
[51,null,null,null,null,null,"---",null,"---",null,"---",null,"---",null,"---",null,"---",null,"---"]
[52,null,null,null,null,null,"---",null,"---",null,"---",null,"---",null,"---",null,"---",null,"---"]
[53,null,null,null,null,null,"---",null,"---",null,"---",null,"---",null,"---",null,"---",null,"---"]
[54,null,null,null,null,null,"---",null,"---",null,"---",null,"---",null,"---",null,"---",null,"---"]
[55,null,null,null,null,null,"---",null,"---",null,"---",null,"---",null,"---",null,"---",null,"---"]
[56,null,null,null,null,null,"---",null,"---",null,"---",null,"---",null,"---",null,"---",null,"---"]
[57,null,null,null,null,null,"---",null,"---",null,"---",null,"---",null,"---",null,"---",null,"---"]
[58,null,null,null,null,null,"---",null,"---",null,"---",null,"---",null,"---",null,"---",null,"---"]
[59,null,null,null,null,null,"---",null,"---",null,"---",null,"---",null,"---",null,"---",null,"---"]
[60,null,null,null,null,null,"---",null,"---",null,"---",null,"---",null,"---",null,"---",null,"---"]
[61,null,null,null,null,null,"---",null,"---",null,"---",null,"---",null,"---",null,"---",null,"---"]
[62,null,null,null,null,null,"---",null,"---",null,"---",null,"---",null,"---",null,"---",null,"---"]
[63,null,null,null,null,null,"---",null,"---",null,"---",null,"---",null,"---",null,"---",null,"---"]
[64,null,null,null,null,null,"---",null,"---",null,"---",null,"---",null,"---",null,"---",null,"---"]
[65,null,null,null,null,null,"---",null,"---",null,"---",null,"---",null,"---",null,"---",null,"---"]
[66,null,null,null,null,null,"---",null,"---",null,"---",null,"---",null,"---",null,"---",null,"---"]
[67,null,null,null,null,null,"---",null,"---",null,"---",null,"---",null,"---",null,"---",null,"---"]
[68,null,null,null,null,null,"---",null,"---",null,"---",null,"---",null,"---",null,"---",null,"---"]
[69,null,null,null,null,null,"---",null,"---",null,"---",null,"---",null,"---",null,"---",null,"---"]
[70,null,null,null,null,null,"---",null,"---",null,"---",null,"---",null,"---",null,"---",null,"---"]
[71,null,null,null,null,null,"---",null,"---",null,"---",null,"---",null,"---",null,"---",null,"---"]
[72,null,null,null,null,null,"---",null,"---",null,"---",null,"---",null,"---",null,"---",null,"---"]
[73,null,null,null,null,null,"---",null,"---",null,"---",null,"---",null,"---",null,"---",null,"---"]
[74,null,null,null,null,null,"---",null,"---",null,"---",null,"---",null,"---",null,"---",null,"---"]
[75,null,null,null,null,null,"---",null,"---",null,"---",null,"---",null,"---",null,"---",null,"---"]
[76,null,null,null,null,null,"---",null,"---",null,"---",null,"---",null,"---",null,"---",null,"---"]
[77,null,null,null,null,null,"---",null,"---",null,"---",null,"---",null,"---",null,"---",null,"---"]
[78,null,null,null,null,null,"---",null,"---",null,"---",null,"---",null,"---",null,"---",null,"---"]
[79,null,null,null,null,null,"---",null,"---",null,"---",null,"---",null,"---",null,"---",null,"---"]
[80,null,null,null,null,null,"---",null,"---",null,"---",null,"---",null,"---",null,"---",null,"---"]
[81,null,null,null,null,null,"---",null,"---",null,"---",null,"---",null,"---",null,"---",null,"---"]
[82,null,null,null,null,null,"---",null,"---",null,"---",null,"---",null,"---",null,"---",null,"---"]
[83,null,null,null,null,null,"---",null,"---",null,"---",null,"---",null,"---",null,"---",null,"---"]
[84,null,null,null,null,null,"---",null,"---",null,"---",null,"---",null,"---",null,"---",null,"---"]
[85,null,null,null,null,null,"---",null,"---",null,"---",null,"---",null,"---",null,"---",null,"---"]
[86,null,null,null,null,null,"---",null,"---",null,"---",null,"---",null,"---",null,"---",null,"---"]
[87,null,null,null,null,null,"---",null,"---",null,"---",null,"---",null,"---",null,"---",null,"---"]
[88,null,null,null,null,null,"---",null,"---",null,"---",null,"---",null,"---",null,"---",null,"---"]
[89,null,null,null,null,null,"---",null,"---",null,"---",null,"---",null,"---",null,"---",null,"---"]
[90,null,null,null,null,null,"---",null,"---",null,"---",null,"---",null,"---",null,"---",null,"---"]
[91,null,null,null,null,null,"---",null,"---",null,"---",null,"---",null,"---",null,"---",null,"---"]
[92,null,null,null,null,null,"---",null,"---",null,"---",null,"---",null,"---",null,"---",null,"---"]
[93,null,null,null,null,null,"---",null,"---",null,"---",null,"---",null,"---",null,"---",null,"---"]
[94,null,null,null,null,null,"---",null,"---",null,"---",null,"---",null,"---",null,"---",null,"---"]
[95,null,null,null,null,null,"---",null,"---",null,"---",null,"---",null,"---",null,"---",null,"---"]
[96,null,null,null,null,null,"---",null,"---",null,"---",null,"---",null,"---",null,"---",null,"---"]
[97,null,null,null,null,null,"---",null,"---",null,"---",null,"---",null,"---",null,"---",null,"---"]
[98,null,null,null,null,null,"---",null,"---",null,"---",null,"---",null,"---",null,"---",null,"---"]
[99,null,null,null,null,null,"---",null,"---",null,"---",null,"---",null,"---",null,"---",null,"---"]
[100,null,null,null,null,null,"---",null,"---",null,"---",null,"---",null,"---",null,"---",null,"---"]

{"sheet":"アレルゲン","index":2,"n_rows":5,"n_cols":4,"rows_kept":5,"cut":false,"hidden":true,"merged":[]}
[1,{"$f":"VLOOKUP(D$1,対象者!$A:$S,7,FALSE)","v":{"$error":"#N/A"}},"個人番号",{"$f":"'アレルギー献立表 '!H3","v":0}]
[2,{"$f":"VLOOKUP(D$1,対象者!$A:$S,9,FALSE)","v":{"$error":"#N/A"}}]
[3,{"$f":"VLOOKUP(D$1,対象者!$A:$S,11,FALSE)","v":{"$error":"#N/A"}}]
[4,{"$f":"VLOOKUP(D$1,対象者!$A:$S,13,FALSE)","v":{"$error":"#N/A"}}]
[5,{"$f":"VLOOKUP(D$1,対象者!$A:$S,15,FALSE)","v":{"$error":"#N/A"}}]