{"text_format":"1","workbook":"xlsx","n_sheets":3,"sheets":["アレルギー献立表","対象者","アレルゲン"],"not_rendered":{"charts":0,"images":1,"macros":1,"external_links":0,"defined_names":1,"comments":0,"pivot_tables":0},"unopened":[],"bounds":{"document_bytes":16777216,"sheet_cells":100000,"rows_first":2000,"rows_last":500,"rows_between":2000,"halvings":0,"cell_chars":16384,"cell_head_chars":4096},"cells_cut":0,"cells_raw":0,"read":"whole","date_system":"1900"}

{"sheet":"アレルギー献立表","index":0,"n_rows":177,"n_cols":8,"rows_kept":177,"cut":false,"hidden":false,"merged":[[203,0,206,0],[207,0,210,0],[181,0,182,0],[183,0,184,0],[185,0,188,0],[189,0,192,0],[199,0,200,0],[201,0,202,0],[163,0,174,0],[6,0,19,0],[20,0,33,0],[34,0,41,0],[43,0,45,0],[60,0,78,0],[79,0,91,0],[92,0,98,0],[99,0,102,0],[114,0,134,0],[135,0,149,0],[150,0,162,0]]}
[null,{"$f":"CONCATENATE(IFERROR(VLOOKUP($H$3,対象者!$A:$O,2,FALSE),\"\"),DBCS(IFERROR(VLOOKUP($H$3,対象者!$A:$O,3,FALSE),\"\")),IFERROR(IF($H$3=\"\",\"\",\"年\"),\"\"))","v":""},{"$f":"IFERROR(VLOOKUP($H$3,対象者!$A:$O,4,FALSE),\"\")","v":""},{"$f":"IFERROR(VLOOKUP($H$3,対象者!$A:$O,5,FALSE),\"\")","v":""},null,null," "]
[null,{"$f":"CONCATENATE(IFERROR(VLOOKUP($H$3,対象者!$A:$O,6,FALSE),\"\"),\" \",IFERROR(VLOOKUP($H$3,対象者!$A:$O,7,FALSE),\"\"))","v":" "},{"$f":"CONCATENATE(IFERROR(VLOOKUP($H$3,対象者!$A:$O,8,FALSE),\"\"),\" \",IFERROR(VLOOKUP($H$3,対象者!$A:$O,9,FALSE),\"\"))","v":" "},{"$f":"CONCATENATE(IFERROR(VLOOKUP($H$3,対象者!$A:$O,10,FALSE),\"\"),\" \",IFERROR(VLOOKUP($H$3,対象者!$A:$O,11,FALSE),\"\"))","v":" "},{"$f":"CONCATENATE(IFERROR(VLOOKUP($H$3,対象者!$A:$O,12,FALSE),\"\"),\" \",IFERROR(VLOOKUP($H$3,対象者!$A:$O,13,FALSE),\"\"))","v":" "},{"$f":"CONCATENATE(IFERROR(VLOOKUP($H$3,対象者!$A:$O,14,FALSE),\"\"),\" \",IFERROR(VLOOKUP($H$3,対象者!$A:$O,15,FALSE),\"\"))","v":" "}," ","番号"]
["　","令和６年度　７月アレルギー献立表",null,null,null,"小学校－１"," "]
["日","2024-07-01","2024-07-02","2024-07-03","2024-07-04","2024-07-05"," "]
["主食","麦ごはん","ごはん","◎●⑦クロス\n　　　　ロールパン","わかめごはん","麦ごはん"," "]
["牛乳","◎牛乳","◎牛乳","◎はっこう乳","◎牛乳","◎牛乳"," "]
["食缶","【トックスープ】","【かきたま汁】","【パンプキン\n　　ポタージュ】","【肉じゃが】","【七夕汁】"," "]
[null,"　たまねぎ(25)　","⑦豆腐(25)　","　たまねぎ(40)　","　じゃがいも(90)　","　とうがん(30)　"," "]
[null,"　トック(20)　","○液卵(20)　","　かぼちゃ(25)　","　たまねぎ(40)　","　にんじん(10)　"," "]
[null,"⑧鶏肉(15)　","⑧鶏肉(15)　","　にんじん(10)　","　こんにゃく(20)　","　オクラ(8)　"," "]
[null,"　にんじん(10)　","　たまねぎ(15)　","　かぼちゃペースト(8)　","　にんじん(20)　","　星型かまぼこ(8)　"," "]
[null,"　たけのこ(8)　","　かまぼこ(10)　","⑧鶏肉(10)　","⑩豚肉(15)　","●サボテン\n　　きしめん(4)　"," "]
[null,"　チンゲンサイ(8)　","　にんじん(5)　","　マッシュルーム(10)　","　グリンピース(4)　","　しいたけ(0.5)　"," "]
[null,"　とうもろこし(5)　","　えのきたけ(5)　","◎牛乳(30)　","●⑦しょうゆ(4.5)　","●⑦うす口\n　　　しょうゆ(4)　"," "]
[null,"⑧⑩中華ガラスープ\n　　　　　の素(3.5)　","　みつば(3)　","　ホワイトルウ\n　　　　[えがお](5)　","　砂糖(3)　","　本みりん(1)　"," "]
[null,"●⑦しょうゆ(1.2)　","●⑦しょうゆ(4)　","◎脱脂粉乳(2)　","　本みりん(1)　","　塩(0.2)　"," "]
[null,"　酒(1)　","　塩(0.3)　","⑦⑩洋風だしの素(1)　","　塩(0.2)　","　むろ削り(4)　"," "]
[null,"　塩(0.1)　","　でん粉(1)　","　塩(0.5)　","　こしょう(0.02)　",""," "]
[null,"　こしょう(0.03)　","　むろ削り(3)　","　こしょう(0.04)　","",""," "]
[null,"","","","",""," "]
["フライ缶","【揚げえび\n　　しゅうまい】","【なす入り肉みそ\n　　ひじき丼の具】","【キャベツと\n　ウインナーのソテー】","【かつおと大豆の\n　レモンじょうゆ和え】","【ハンバーグの\n　　おろしだれかけ】"," "]
[null,"　えび入りしゅうまい\n　　　　　　 2個(36)　","　たまねぎ(30)　","　キャベツ(30)　","　かつお打ち粉付き\n　　　　　　　(40)　","　ハンバーグ 1個(50)　"," "]
[null,"　米油(3.6)　","⑩豚肉(30)　","⑩ポーク\n　　ウインナー(20)　","⑦大豆(15)","　大根おろし(10)　"," "]
[null,"","　なす(8)　","　ピーマン(5)　","　でん粉(3)　","●⑦しょうゆ(3)　"," "]
[null,"《えび入り\n　　　　しゅうまい》","　にんじん(8)　","　にんじん(5)　","　米油(5.8)　","　砂糖(2)　"," "]
[null,"　すけとうだら","　米ひじき(1.4)　","　とうもろこし(5)　","　砂糖(2)　","　本みりん(1)　"," "]
[null,"△えび","　しょうが(1)　","　米油(0.5)　","　レモン果汁(1.5)　",""," "]
[null,"　たまねぎ　","⑦豆みそ(4)　","　塩(0.2)　","●⑦しょうゆ(1)　","《ハンバーグ》"," "]
[null,"　でん粉","　砂糖(2.5)　","　こしょう(0.02)　","","⑧鶏肉"," "]
[null,"⑦粒状大豆たん白","　酒(2)　","",null,"⑩豚肉"," "]
[null,"●小麦粉","　本みりん(1.5)　","","","　たまねぎ"," "]
[null,"⑩⑯調味料等","●⑦しょうゆ(1)　",null,"","　でん紛"," "]
[null,"","　でん粉(0.5)　","","","⑩調味料等"," "]
[null,"","","","",""," "]
["あえ物・果物","【もやしのナムル】","【冷凍みかん】","","","【きゅうりの\n　　塩昆布あえ】"," "]
[null,"　もやし(30)　","　みかん 1個(120)　","","","　きゅうり(25)　"," "]
[null,"④白すりごま(1)　","","","","　にんじん(3)　"," "]
[null,"●⑦しょうゆ(1)　","","","","　塩昆布(1.2)　"," "]
[null,"　砂糖(0.5)　","","","",""," "]
[null,"　米酢(0.5)　","","","","《塩昆布》"," "]
[null,"④ごま油(0.3)　","","","","　昆布"," "]
[null,"","","","","●⑦調味料等"," "]
[null,null,null,null,null,null," "]
["その他","【いわしの干し小魚】","","","","【七夕ゼリー】"," "]
[null,"　いわしの干し小魚\n　　　　　　 １袋(5)　","","","","　七夕フルーツ\n　　ゼリー 1個(40)　"," "]
[null,"","","","",""," "]
["　",null,null,null,null,"（　）内は純使用量　単位：グラム"," "]
["※","アレルギー物質の21品目について、次のように表示しています。",null,null,null,null," "]
["　","○…卵","◎…乳","●…小麦","△…えび","▲…かに"," "]
["　","①…いか","②…オレンジ","③…牛肉","④…ごま","⑤…さけ"," "]
["　","⑥…さば","⑦…大豆","⑧…鶏肉","⑨…バナナ","⑩…豚肉"," "]
["　","⑪…もも","⑫…やまいも","⑬…りんご","⑭…ゼラチン",null," "]
["　","⑮…種実（ぎんなん・くり・ココナッツ）",null,null,"⑯…貝（あさり・ほたて等）",null," "]
["１","パンに表示される⑦大豆については、添加物のレシチンに含まれる微量のアレルゲンを示します。",null,null,null,null," "]
["２","アレルギー献立表の見方については、「保存版ＮＯ．１」を参照してください。",null,null,null,null," "]
["　",null,null,null,null,null," "]
["　",null,null,null,null,"小学校－２"," "]
["日","2024-07-08","2024-07-09","2024-07-10","2024-07-11","2024-07-12"," "]
["主食","ごはん","麦ごはん","ごはん","◎●⑦ミルク\n　　　　ロールパン","ごはん"," "]
["牛乳","◎牛乳","◎牛乳","◎牛乳","◎牛乳","◎牛乳"," "]
["食缶","【スタミナ汁】","【サボテン\n　　　キーマカレー】","【もずく入り五目汁】","【大豆とウインナーの\n　　　　　トマト煮】","【ジャーチャン\n              ドウフ】"," "]
[null,"⑦豆腐(30)　","　たまねぎ(60)　","　じゃがいも(20)　","　たまねぎ(35)　","⑦生揚げ(40)　"," "]
[null,"　じゃがいも(20)　","⑩豚肉(30)　","⑧鶏肉(20)　","⑦大豆(35)　","　たまねぎ(40)　"," "]
[null,"　たまねぎ(15)　","　にんじん(25)　","　大根(20)　","　じゃがいも(20)　","⑩豚肉(25)　"," "]
[null,"⑩豚肉(15)　","　トマト(10)　","　かまぼこ(10)　","　トマト(15)　","　にんじん(15)　"," "]
[null,"　ねぎ(8)　","　マッシュルーム(8)　","　ごぼう(5)　","⑩ポークウインナー\n　　　　　　　　(15)　","　ねぎ(7)　"," "]
[null,"　にんじん(5)　","　とうもろこし(5)　","　にんじん(5)　","　にんじん(10)　","　しいたけ(0.5)　"," "]
[null,"⑦油揚げ(3)　","　うちわサボテン(3)　","　もずく(5)　","　ズッキーニ(8)　","　しょうが(0.5)　"," "]
[null,"　にんにく(0.2)　","　カレールウ\n　　　[えがお](10)　","　ねぎ(5)　","　セロリ(2)　","●⑦しょうゆ(5)　"," "]
[null,"⑦合わせみそ(9)　","⑦⑩洋風だしの素\n　　　　　　　(1.5)　","●⑦しょうゆ(4)　","　にんにく(0.3)　","⑦豆みそ(2.5)　"," "]
[null,"　むろ削り(3)　","　純カレー(0.3)　","　本みりん(1)　","　トマトジュース(10)　","　砂糖(2)　"," "]
[null,"","　塩(0.3)　","　塩(0.1)　","　トマトケチャップ(7)","　豆板醤(0.1)　"," "]
[null,"","　こしょう(0.02)　","　和風だしの素(1)　","　ソース(2)　","　でん粉(1)　"," "]
[null,"","","","　砂糖(1)　",""," "]
[null,"","","","⑦⑩洋風だしの素(1)　",""," "]
[null,"","","","　赤ワイン(1)　",""," "]
[null,"","","","　塩(0.4)　",""," "]
[null,"","","","　こしょう(0.04)　",""," "]
[null,"","","","",""," "]
["フライ缶","【まぐろの甘辛煮】","【枝豆コロッケ】","【ゴーヤ\n　　チャンプルー】","【ツナサラダ】","【さけ団子の\n　　　　甘酢あん】"," "]
[null,"　まぐろ油漬け(45)　","　枝豆コロッケ\n　　　　　1個(50)　","⑦生揚げ(25)　","　キャベツ(20)　","⑤さけ団子(30)　"," "]
[null,"　キャベツ(12)　","　米油(5)　","○炒り卵(20)　","　きゅうり(20)　","　米油(3)　"," "]
[null,"　しょうが(1)　","","　ゴーヤ(15)　","　まぐろ油漬け(10)　","　たまねぎ(20)　"," "]
[null,"　砂糖(3)　","《枝豆コロッケ》","⑩豚肉(15)　","　とうもろこし(5)　","　にんじん(10)　"," "]
[null,"●⑦しょうゆ(1.5)　","⑦枝豆","●⑦しょうゆ(2)　","　にんじん(3)　","　たけのこ(10)　"," "]
[null,"　本みりん(1)　","　じゃがいも","　砂糖(2)　","　砂糖(1)　","　黄パプリカ(8)　"," "]
[null,"　酒(1)　","●パン粉","⑦⑧⑩⑯中華だしの素\n　　　　　　　　(0.5)　","　ワインビネガー(1)　","　トマトケチャップ\n　　　　　　　(2.5)　"," "]
[null,"","●小麦粉","　塩(0.1)　","●⑦しょうゆ(0.8)　","●⑦しょうゆ(1.5)　"," "]
[null,"","⑦植物性たん白","　こしょう(0.03)　","　オリーブ油(0.5)　","　砂糖(1.5)　"," "]
[null,"",null,"　米油(0.3)　","　塩(0.1)　","　米酢(1)　"," "]
[null,"","",null,"　こしょう(0.02)　","　でん粉(0.5)　"," "]
[null,"","","","",""," "]
["あえ物・果物","【きざみたくあん】","【きゅうりの\n　　　サワー漬け】","","【冷凍パイナップル】",""," "]
[null,"　たくあん漬け(13)　","　きゅうり(25)　","","　パイナップル\n　　　　　1個(40)　",""," "]
[null,"","●⑦しょうゆ(1)　","","",""," "]
[null,"《たくあん漬け》","　ワインビネガー(1)　","","",""," "]
[null,"　大根","　砂糖(0.5)　","","",""," "]
[null,"●⑦調味料等",null,null,null,null," "]
[null,"","","","",""," "]
["その他","【手巻きのり】","","【豆乳ココアプリン】","","【プルーン】"," "]
[null,"　のり 1袋(2.5)　","","⑦豆乳ココアプリン 　\n　　　　　　1個(50)　","","　プルーン 1袋(20)　"," "]
[null,"","","","",""," "]
[null,"","","","",""," "]
["　",null,null,null,null,"（　）内は純使用量　単位：グラム"," "]
[null,null,null,null,null,null," "]
[null,null,null,null,null,null," "]
[null,null,null,null,null,null," "]
[null,null,null,null,null,null," "]
[null,null,null,null,null,null," "]
["　",null,null,null,null,null," "]
["　",null,null,null,null,"小学校－３"," "]
["日","2024-07-16","2024-07-17","2024-07-18",null,null," "]
["主食","麦ごはん","ごはん","ごはん","",""," "]
["牛乳","◎牛乳","◎牛乳","◎牛乳","",""," "]
["食缶","【牛丼の具】","【卵とじ】","【ハッシュドビーフ】","",""," "]
[null,"　たまねぎ(65)　","○液卵(40)　","　たまねぎ(50)　","",""," "]
[null,"　しらたき(30)　","　じゃがいも(35)　","③牛肉(30)　","",""," "]
[null,"③牛肉(25)　","　たまねぎ(30)　","　にんじん(15)　","",""," "]
[null,"⑦焼き豆腐(20)　","⑧鶏肉(20)　","　グリンピース(4)　","",""," "]
[null,"　ねぎ(15)　","　にんじん(10)　","　にんにく(0.3)　","",""," "]
[null,"　にんじん(10)　","　さやいんげん(5)　","　ハヤシルウ[えがお]\n　　　　　　　　(12)　","",""," "]
[null,"　エリンギ(10)　","●⑦しょうゆ(4.2)　","　トマトピューレ(10)　","",""," "]
[null,"●⑦しょうゆ(6)　","　砂糖(1.6)　","　デミグラスソース(6)　","",""," "]
[null,"　砂糖(2.5)　","　本みりん(1)　","　トマトケチャップ(5)　","",""," "]
[null,"　酒(2)　","　和風だしの素(1)　","　赤ワイン(1)　","",""," "]
[null,"","","⑦⑩洋風だしの素\n　　　　　　　(0.5)　","",""," "]
[null,"","","　塩(0.3)　","",""," "]
[null,"","","　砂糖(0.2)　","",""," "]
[null,"","","　こしょう(0.03)　","",""," "]
[null,null,null,null,null,null," "]
[null,null,null,"《デミグラスソース》",null,null," "]
[null,null,null,"●小麦粉",null,null," "]
[null,null,null,"　トマト",null,null," "]
[null,null,null,"⑧⑩調味料等",null,null," "]
[null,"","","","",""," "]
["フライ缶","【ちくわのいそべ揚げ】","【さばのみそ煮】","【シャキシャキ\n　　　ポテトサラダ】","",""," "]
[null,"　ちくわ  2個(40)　","　さばのみそ煮\n　　　　　1個(50)　","　じゃがいも(40)　","",""," "]
[null,"●小麦粉(3)　","","　まぐろ油漬け(10)　","",""," "]
[null,"　でん粉(1)　","《さばのみそ煮》","　きゅうり(8)　","",""," "]
[null,"　青のり粉(0.12)　","⑥さば","　キャベツ(8)　","",""," "]
[null,"　米油(4.52)　","⑦調味料等","　卵なしマヨネーズ(6)　","",""," "]
[null,"","","　米酢(0.5)　","",""," "]
[null,"","","　塩(0.05)　","",""," "]
[null,"","","　こしょう(0.01)　","",""," "]
[null,null,null,null,null,null," "]
[null,null,null,"《卵なしマヨネーズ》",null,null," "]
[null,null,null,"⑦大豆粉",null,null," "]
[null,null,null,"⑦粉末状植物性たん白",null,null," "]
[null,null,null,"　調味料等",null,null," "]
[null,"","","","",""," "]
["あえ物・果物","【えだ豆】","【きゅうりの\n　　　　梅ごま和え】","","",""," "]
[null,"⑦枝豆(12)　","　きゅうり(20)　","","",""," "]
[null,null,"　梅びしお(1.5)　","","",""," "]
[null,"","④白ごま(1)　","","",""," "]
[null,"","●⑦しょうゆ(0.25)　","","",""," "]
[null,"","　砂糖(0.25)　","","",""," "]
[null,null,null,null,null,null," "]
[null,null,"《梅びしお》",null,null,null," "]
[null,null,"　梅",null,null,null," "]
[null,null,"　梅肉",null,null,null," "]
[null,null,"　赤じそ",null,null,null," "]
[null,null,"⑬調味料等",null,null,null," "]
[null,"","","","",""," "]
["その他","","","【セレクトデザート】","",""," "]
[null,"","","　ミニチョコたい焼き\n　　　　　　1個(27)　","",""," "]
[null,null,null,null,null,null," "]
[null,null,null,"《ミニチョコたい焼き》",null,null," "]
[null,null,null,"●小麦粉",null,null," "]
[null,null,null,"○鶏卵",null,null," "]
[null,null,null,"◎全粉乳",null,null," "]
[null,null,null,"◎生クリーム",null,null," "]
[null,null,null,"◎⑦調味料等",null,null," "]
[null,null,null,null,null,null," "]
[null,"","","　アセロラゼリー\n　　　　　　1個(40)","",""," "]
[null,"","","","",""," "]
["　",null,null,"（　）内は純使用量　単位：グラム",null,null," "]
["　"]

{"sheet":"対象者","index":1,"n_rows":101,"n_cols":21,"rows_kept":101,"cut":false,"hidden":true,"merged":[]}
["番号","学校","学年","組","氏名","アレ１","１記号","アレ２","２記号","アレ３","３記号","アレ４","４記号","アレ５","５記号","アレ６","６記号","アレ７","７記号",1,"アレルゲンはドロップダウンリストから選択してください。"]
[1,null,null,null,null,null,"---",null,"---",null,"---",null,"---",null,"---",null,"---",null,"---",2,"アレルギー献立表に表示可能なアレルゲンは５種類までとなります。※６、７は参考入力"]
[2,null,null,null,null,null,"---",null,"---",null,"---",null,"---",null,"---",null,"---",null,"---","※","５種類を超えるアレルゲンのある場合は、弁当持参を促すべき児童生徒と言えます。"]
[3,null,null,null,null,null,"---",null,"---",null,"---",null,"---",null,"---",null,"---",null,"---",3,"このリストをアレルギー献立表の「対象者」シートにコピーして「値のみ」を貼り付けてください。"]
[4,null,null,null,null,null,"---",null,"---",null,"---",null,"---",null,"---",null,"---",null,"---",4,"対象者を100人以上登録したいときは、A100～R101を選択してコピー（又はオートフィル）してください。"]
[5,null,null,null,null,null,"---",null,"---",null,"---",null,"---",null,"---",null,"---",null,"---"]
[6,null,null,null,null,null,"---",null,"---",null,"---",null,"---",null,"---",null,"---",null,"---"]
[7,null,null,null,null,null,"---",null,"---",null,"---",null,"---",null,"---",null,"---",null,"---"]
[8,null,null,null,null,null,"---",null,"---",null,"---",null,"---",null,"---",null,"---",null,"---"]
[9,null,null,null,null,null,"---",null,"---",null,"---",null,"---",null,"---",null,"---",null,"---"]
[10,null,null,null,null,null,"---",null,"---",null,"---",null,"---",null,"---",null,"---",null,"---"]
[11,null,null,null,null,null,"---",null,"---",null,"---",null,"---",null,"---",null,"---",null,"---"]
[12,null,null,null,null,null,"---",null,"---",null,"---",null,"---",null,"---",null,"---",null,"---"]
[13,null,null,null,null,null,"---",null,"---",null,"---",null,"---",null,"---",null,"---",null,"---"]
[14,null,null,null,null,null,"---",null,"---",null,"---",null,"---",null,"---",null,"---",null,"---"]
[15,null,null,null,null,null,"---",null,"---",null,"---",null,"---",null,"---",null,"---",null,"---"]
[16,null,null,null,null,null,"---",null,"---",null,"---",null,"---",null,"---",null,"---",null,"---"]
[17,null,null,null,null,null,"---",null,"---",null,"---",null,"---",null,"---",null,"---",null,"---"]
[18,null,null,null,null,null,"---",null,"---",null,"---",null,"---",null,"---",null,"---",null,"---"]
[19,null,null,null,null,null,"---",null,"---",null,"---",null,"---",null,"---",null,"---",null,"---"]
[20,null,null,null,null,null,"---",null,"---",null,"---",null,"---",null,"---",null,"---",null,"---"]
[21,null,null,null,null,null,"---",null,"---",null,"---",null,"---",null,"---",null,"---",null,"---"]
[22,null,null,null,null,null,"---",null,"---",null,"---",null,"---",null,"---",null,"---",null,"---"]
[23,null,null,null,null,null,"---",null,"---",null,"---",null,"---",null,"---",null,"---",null,"---"]
[24,null,null,null,null,null,"---",null,"---",null,"---",null,"---",null,"---",null,"---",null,"---"]
[25,null,null,null,null,null,"---",null,"---",null,"---",null,"---",null,"---",null,"---",null,"---"]
[26,null,null,null,null,null,"---",null,"---",null,"---",null,"---",null,"---",null,"---",null,"---"]
[27,null,null,null,null,null,"---",null,"---",null,"---",null,"---",null,"---",null,"---",null,"---"]
[28,null,null,null,null,null,"---",null,"---",null,"---",null,"---",null,"---",null,"---",null,"---"]
[29,null,null,null,null,null,"---",null,"---",null,"---",null,"---",null,"---",null,"---",null,"---"]
[30,null,null,null,null,null,"---",null,"---",null,"---",null,"---",null,"---",null,"---",null,"---"]
[31,null,null,null,null,null,"---",null,"---",null,"---",null,"---",null,"---",null,"---",null,"---"]
[32,null,null,null,null,null,"---",null,"---",null,"---",null,"---",null,"---",null,"---",null,"---"]
[33,null,null,null,null,null,"---",null,"---",null,"---",null,"---",null,"---",null,"---",null,"---"]
[34,null,null,null,null,null,"---",null,"---",null,"---",null,"---",null,"---",null,"---",null,"---"]
[35,null,null,null,null,null,"---",null,"---",null,"---",null,"---",null,"---",null,"---",null,"---"]
[36,null,null,null,null,null,"---",null,"---",null,"---",null,"---",null,"---",null,"---",null,"---"]
[37,null,null,null,null,null,"---",null,"---",null,"---",null,"---",null,"---",null,"---",null,"---"]
[38,null,null,null,null,null,"---",null,"---",null,"---",null,"---",null,"---",null,"---",null,"---"]
[39,null,null,null,null,null,"---",null,"---",null,"---",null,"---",null,"---",null,"---",null,"---"]
[40,null,null,null,null,null,"---",null,"---",null,"---",null,"---",null,"---",null,"---",null,"---"]
[41,null,null,null,null,null,"---",null,"---",null,"---",null,"---",null,"---",null,"---",null,"---"]
[42,null,null,null,null,null,"---",null,"---",null,"---",null,"---",null,"---",null,"---",null,"---"]
[43,null,null,null,null,null,"---",null,"---",null,"---",null,"---",null,"---",null,"---",null,"---"]
[44,null,null,null,null,null,"---",null,"---",null,"---",null,"---",null,"---",null,"---",null,"---"]
[45,null,null,null,null,null,"---",null,"---",null,"---",null,"---",null,"---",null,"---",null,"---"]
[46,null,null,null,null,null,"---",null,"---",null,"---",null,"---",null,"---",null,"---",null,"---"]
[47,null,null,null,null,null,"---",null,"---",null,"---",null,"---",null,"---",null,"---",null,"---"]
[48,null,null,null,null,null,"---",null,"---",null,"---",null,"---",null,"---",null,"---",null,"---"]
[49,null,null,null,null,null,"---",null,"---",null,"---",null,"---",null,"---",null,"---",null,"---"]
[50,null,null,null,null,null,"---",null,"---",null,"---",null,"---",null,"---",null,"---",null,"---"]
[51,null,null,null,null,null,"---",null,"---",null,"---",null,"---",null,"---",null,"---",null,"---"]
[52,null,null,null,null,null,"---",null,"---",null,"---",null,"---",null,"---",null,"---",null,"---"]
[53,null,null,null,null,null,"---",null,"---",null,"---",null,"---",null,"---",null,"---",null,"---"]
[54,null,null,null,null,null,"---",null,"---",null,"---",null,"---",null,"---",null,"---",null,"---"]
[55,null,null,null,null,null,"---",null,"---",null,"---",null,"---",null,"---",null,"---",null,"---"]
[56,null,null,null,null,null,"---",null,"---",null,"---",null,"---",null,"---",null,"---",null,"---"]
[57,null,null,null,null,null,"---",null,"---",null,"---",null,"---",null,"---",null,"---",null,"---"]
[58,null,null,null,null,null,"---",null,"---",null,"---",null,"---",null,"---",null,"---",null,"---"]
[59,null,null,null,null,null,"---",null,"---",null,"---",null,"---",null,"---",null,"---",null,"---"]
[60,null,null,null,null,null,"---",null,"---",null,"---",null,"---",null,"---",null,"---",null,"---"]
[61,null,null,null,null,null,"---",null,"---",null,"---",null,"---",null,"---",null,"---",null,"---"]
[62,null,null,null,null,null,"---",null,"---",null,"---",null,"---",null,"---",null,"---",null,"---"]
[63,null,null,null,null,null,"---",null,"---",null,"---",null,"---",null,"---",null,"---",null,"---"]
[64,null,null,null,null,null,"---",null,"---",null,"---",null,"---",null,"---",null,"---",null,"---"]
[65,null,null,null,null,null,"---",null,"---",null,"---",null,"---",null,"---",null,"---",null,"---"]
[66,null,null,null,null,null,"---",null,"---",null,"---",null,"---",null,"---",null,"---",null,"---"]
[67,null,null,null,null,null,"---",null,"---",null,"---",null,"---",null,"---",null,"---",null,"---"]
[68,null,null,null,null,null,"---",null,"---",null,"---",null,"---",null,"---",null,"---",null,"---"]
[69,null,null,null,null,null,"---",null,"---",null,"---",null,"---",null,"---",null,"---",null,"---"]
[70,null,null,null,null,null,"---",null,"---",null,"---",null,"---",null,"---",null,"---",null,"---"]
[71,null,null,null,null,null,"---",null,"---",null,"---",null,"---",null,"---",null,"---",null,"---"]
[72,null,null,null,null,null,"---",null,"---",null,"---",null,"---",null,"---",null,"---",null,"---"]
[73,null,null,null,null,null,"---",null,"---",null,"---",null,"---",null,"---",null,"---",null,"---"]
[74,null,null,null,null,null,"---",null,"---",null,"---",null,"---",null,"---",null,"---",null,"---"]
[75,null,null,null,null,null,"---",null,"---",null,"---",null,"---",null,"---",null,"---",null,"---"]
[76,null,null,null,null,null,"---",null,"---",null,"---",null,"---",null,"---",null,"---",null,"---"]
[77,null,null,null,null,null,"---",null,"---",null,"---",null,"---",null,"---",null,"---",null,"---"]
[78,null,null,null,null,null,"---",null,"---",null,"---",null,"---",null,"---",null,"---",null,"---"]
[79,null,null,null,null,null,"---",null,"---",null,"---",null,"---",null,"---",null,"---",null,"---"]
[80,null,null,null,null,null,"---",null,"---",null,"---",null,"---",null,"---",null,"---",null,"---"]
[81,null,null,null,null,null,"---",null,"---",null,"---",null,"---",null,"---",null,"---",null,"---"]
[82,null,null,null,null,null,"---",null,"---",null,"---",null,"---",null,"---",null,"---",null,"---"]
[83,null,null,null,null,null,"---",null,"---",null,"---",null,"---",null,"---",null,"---",null,"---"]
[84,null,null,null,null,null,"---",null,"---",null,"---",null,"---",null,"---",null,"---",null,"---"]
[85,null,null,null,null,null,"---",null,"---",null,"---",null,"---",null,"---",null,"---",null,"---"]
[86,null,null,null,null,null,"---",null,"---",null,"---",null,"---",null,"---",null,"---",null,"---"]
[87,null,null,null,null,null,"---",null,"---",null,"---",null,"---",null,"---",null,"---",null,"---"]
[88,null,null,null,null,null,"---",null,"---",null,"---",null,"---",null,"---",null,"---",null,"---"]
[89,null,null,null,null,null,"---",null,"---",null,"---",null,"---",null,"---",null,"---",null,"---"]
[90,null,null,null,null,null,"---",null,"---",null,"---",null,"---",null,"---",null,"---",null,"---"]
[91,null,null,null,null,null,"---",null,"---",null,"---",null,"---",null,"---",null,"---",null,"---"]
[92,null,null,null,null,null,"---",null,"---",null,"---",null,"---",null,"---",null,"---",null,"---"]
[93,null,null,null,null,null,"---",null,"---",null,"---",null,"---",null,"---",null,"---",null,"---"]
[94,null,null,null,null,null,"---",null,"---",null,"---",null,"---",null,"---",null,"---",null,"---"]
[95,null,null,null,null,null,"---",null,"---",null,"---",null,"---",null,"---",null,"---",null,"---"]
[96,null,null,null,null,null,"---",null,"---",null,"---",null,"---",null,"---",null,"---",null,"---"]
[97,null,null,null,null,null,"---",null,"---",null,"---",null,"---",null,"---",null,"---",null,"---"]
[98,null,null,null,null,null,"---",null,"---",null,"---",null,"---",null,"---",null,"---",null,"---"]
[99,null,null,null,null,null,"---",null,"---",null,"---",null,"---",null,"---",null,"---",null,"---"]
[100,null,null,null,null,null,"---",null,"---",null,"---",null,"---",null,"---",null,"---",null,"---"]

{"sheet":"アレルゲン","index":2,"n_rows":5,"n_cols":4,"rows_kept":5,"cut":false,"hidden":true,"merged":[]}
[1,{"$f":"VLOOKUP(D$1,対象者!$A:$S,7,FALSE)","v":{"$error":"#N/A"}},"個人番号",{"$f":"アレルギー献立表!H3","v":0}]
[2,{"$f":"VLOOKUP(D$1,対象者!$A:$S,9,FALSE)","v":{"$error":"#N/A"}}]
[3,{"$f":"VLOOKUP(D$1,対象者!$A:$S,11,FALSE)","v":{"$error":"#N/A"}}]
[4,{"$f":"VLOOKUP(D$1,対象者!$A:$S,13,FALSE)","v":{"$error":"#N/A"}}]
[5,{"$f":"VLOOKUP(D$1,対象者!$A:$S,15,FALSE)","v":{"$error":"#N/A"}}]