{"text_format":"1","workbook":"xlsx","n_sheets":3,"sheets":["アレルギー献立表 (小)","対象者","アレルゲン"],"not_rendered":{"charts":0,"images":1,"macros":1,"external_links":2,"defined_names":1,"comments":0,"pivot_tables":0},"unopened":[],"bounds":{"document_bytes":16777216,"sheet_cells":100000,"rows_first":2000,"rows_last":500,"rows_between":2000,"halvings":0,"cell_chars":16384,"cell_head_chars":4096},"cells_cut":0,"cells_raw":0,"read":"whole","date_system":"1900"}

{"sheet":"アレルギー献立表 (小)","index":0,"n_rows":226,"n_cols":8,"rows_kept":226,"cut":false,"hidden":false,"merged":[[150,0,159,0],[80,0,93,0],[94,0,102,0],[103,0,109,0],[123,0,137,0],[138,0,149,0],[6,0,24,0],[25,0,37,0],[38,0,44,0],[45,0,47,0],[62,0,79,0],[169,0,189,0],[190,0,207,0],[208,0,215,0],[216,0,223,0],[160,0,162,0]]}
[null,{"$f":"CONCATENATE(IFERROR(VLOOKUP($H$3,対象者!$A:$O,2,FALSE),\"\"),DBCS(IFERROR(VLOOKUP($H$3,対象者!$A:$O,3,FALSE),\"\")),IFERROR(IF($H$3=\"\",\"\",\"年\"),\"\"))","v":""},{"$f":"IFERROR(VLOOKUP($H$3,対象者!$A:$O,4,FALSE),\"\")","v":""},{"$f":"IFERROR(VLOOKUP($H$3,対象者!$A:$O,5,FALSE),\"\")","v":""},null,null,"  "]
[null,{"$f":"CONCATENATE(IFERROR(VLOOKUP($H$3,対象者!$A:$O,6,FALSE),\"\"),\" \",IFERROR(VLOOKUP($H$3,対象者!$A:$O,7,FALSE),\"\"))","v":" "},{"$f":"CONCATENATE(IFERROR(VLOOKUP($H$3,対象者!$A:$O,8,FALSE),\"\"),\" \",IFERROR(VLOOKUP($H$3,対象者!$A:$O,9,FALSE),\"\"))","v":" "},{"$f":"CONCATENATE(IFERROR(VLOOKUP($H$3,対象者!$A:$O,10,FALSE),\"\"),\" \",IFERROR(VLOOKUP($H$3,対象者!$A:$O,11,FALSE),\"\"))","v":" "},{"$f":"CONCATENATE(IFERROR(VLOOKUP($H$3,対象者!$A:$O,12,FALSE),\"\"),\" \",IFERROR(VLOOKUP($H$3,対象者!$A:$O,13,FALSE),\"\"))","v":" "},{"$f":"CONCATENATE(IFERROR(VLOOKUP($H$3,対象者!$A:$O,14,FALSE),\"\"),\" \",IFERROR(VLOOKUP($H$3,対象者!$A:$O,15,FALSE),\"\"))","v":" "},"  ","番号"]
["　","令和６年度　９月アレルギー献立表",null,null,null,"小学校－１","  "]
["日","2024-09-03","2024-09-04","2024-09-05","2024-09-06","2024-09-09","  "]
["主食","玄米ごはん","わかめごはん","ごはん","◎●⑦あいちの\n　　　　　米粉パン","ごはん","  "]
["牛乳","◎牛乳","◎牛乳","◎牛乳","◎牛乳","◎牛乳","  "]
["食缶","【えがおの\n　　夏野菜カレー】","【いか団子汁】","【けんちん汁】","【大豆とウインナーの\n    　　　　　トマト煮】","【豚汁】","  "]
[null,"　たまねぎ(40)　","①いか団子(25)　","⑦豆腐(25)　","　たまねぎ(40)　","⑦豆腐(20)　","  "]
[null,"　かぼちゃ(30)　","　大根(20)　","　大根(20)　","⑦大豆(37)　","⑩豚肉(20)　","  "]
[null,"　トマト(20)　","　ほうれん草(10)　","　こんにゃく(15)　","　じゃがいも(20)　","　さといも(15)　","  "]
[null,"　なす(15)　","　にんじん(10)　","　にんじん(10)　","　にんじん(15)　","　大根(15)　","  "]
[null,"⑩豚肉(15)　","　ねぎ(10)　","　ごぼう(10)　","　トマト(15)　","　ごぼう(10)　","  "]
[null,"　にんじん(10)　","●⑦しょうゆ(3)　","　ねぎ(10)　","⑩ポーク\n　　ウインナー(15)　","　にんじん(10)　","  "]
[null,"　ピーマン(5)　","　塩(0.3)　","⑦油揚げ(2)　","　マッシュルーム(5)　","　ねぎ(10)　","  "]
[null,"　しょうが(0.5)　","　むろ削り(3)　","●⑦しょうゆ(4)　","　セロリ(2)　","⑦豆みそ(9)　","  "]
[null,"　にんにく(0.2)　","","④ごま油(0.5)　","　にんにく(0.3)　","　むろ削り(3)　","  "]
[null,"　カレールウ\n　　　[えがお](10)　",null,"　塩(0.3)　","　トマトジュース(10)　","","  "]
[null,"　ソース(2.5)　",null,"　むろ削り(4)　","　トマトケチャップ(7)　","","  "]
[null,"　トマトケチャップ(2)　",null,"","　ソース(2)　","","  "]
[null,"⑦⑩洋風だしの素(1.5)　",null,"","　砂糖(1)　","","  "]
[null,"●⑦しょうゆ(0.7)　",null,"","⑦⑩洋風だしの素(1)　","","  "]
[null,"　純カレー(0.3)　","","","　赤ワイン(1)　","","  "]
[null,"　塩(0.1)　","","","　塩(0.4)　","","  "]
[null,"　こしょう(0.02)　","","","　こしょう(0.04)　","","  "]
[null,"","","","","","  "]
["フライ缶","【ツナサラダ】","【あつあげと\n　小松菜のあんかけ】","【鶏肉のてりかけ】","【コールスロー\n　　　　　サラダ】","【まぐろの甘辛煮】","  "]
[null,"　キャベツ(20)　","⑦生揚げ(35)　","⑧鶏肉(打粉付) \n　　　　 　1個(50)　","　キャベツ(35)　","　まぐろ油漬け(45)　","  "]
[null,"　きゅうり(20)　","⑩豚肉(15)　","　米油(5)　","⑧サラダチキン(12)　","　キャベツ(12)　","  "]
[null,"　まぐろ油漬け(10)　","　にんじん(15)　","●⑦しょうゆ(3.5)　","　きゅうり(10)　","　しょうが(1)　","  "]
[null,"　とうもろこし(5)　","　小松菜(10)　","　砂糖(2.5)　","　とうもろこし(5)　","　砂糖(3)　","  "]
[null,"　にんじん(3)　","　しょうが(0.5)　","　本みりん(0.3)　","　にんじん(5)　","●⑦しょうゆ(1.5)　","  "]
[null,"　砂糖(1)　","●⑦しょうゆ(2.5)　","　でん粉(0.2)　","　コールスロー\n　  ドレッシング(5)　","　本みりん(1)　","  "]
[null,"　ワインビネガー(1)　","　砂糖(1)　","","","　酒(1)　","  "]
[null,"●⑦しょうゆ(0.8)　","　本みりん(1)　","","","","  "]
[null,"　オリーブ油(0.5)　","　塩(0.1)　","","","","  "]
[null,"　塩(0.1)　","④ごま油(0.5)　","","","","  "]
[null,"　こしょう(0.02)　","　でん粉(0.5)　","","","","  "]
[null,"","","","","","  "]
["あえ物・果物","【冷凍みかん】","","【きゅうりの\n　　　ゆかり和え】","","【きざみたくあん】","  "]
[null,"　みかん 1個(120)　","","　きゅうり(25)　","","　たくあん漬け(13)　","  "]
[null,null,null,"　ゆかり粉(0.4)　",null,null,"  "]
[null,null,null,null,null,"《たくあん漬け》","  "]
[null,null,null,null,null,"　大根","  "]
[null,"","",null,"","●⑦調味料等","  "]
[null,"","","","","","  "]
["その他","","【フローズン\n　　　ヨーグルト】","","","【手巻きのり】","  "]
[null,"","◎ヨーグルト 1個(60)　","","","　手巻きのり 1袋(2.5)　","  "]
[null,"","","","","","  "]
["　",null,null,null,null,"（　）内は純使用量　単位：グラム","  "]
["※","アレルギー物質の21品目について、次のように表示しています。",null,null,null,null,"  "]
["　","○…卵","◎…乳","●…小麦","△…えび","▲…かに","  "]
["　","①…いか","②…オレンジ","③…牛肉","④…ごま","⑤…さけ","  "]
["　","⑥…さば","⑦…大豆","⑧…鶏肉","⑨…バナナ","⑩…豚肉","  "]
["　","⑪…もも","⑫…やまいも","⑬…りんご","⑭…ゼラチン",null,"  "]
["　","⑮…種実（ぎんなん・くり・ココナッツ）",null,null,"⑯…貝（あさり・ほたて等）",null,"  "]
["１","パンに表示される⑦大豆については、添加物のレシチンに含まれる微量のアレルゲンを示します。",null,null,null,null,"  "]
["２","アレルギー献立表の見方については、「保存版ＮＯ．１」を参照してください。",null,null,null,null,"  "]
["　",null,null,null,null,null,"  "]
["　",null,null,null,null,"小学校－２","  "]
["日","2024-09-10","2024-09-11","2024-09-12","2024-09-13","2024-09-17","  "]
["主食","麦ごはん","◎●⑦ミルク\n　　　　ロールパン","ごはん","ごはん","ごはん","  "]
["牛乳","◎牛乳","◎牛乳","◎牛乳","◎牛乳","◎牛乳","  "]
["食缶","【八宝菜】","【きのこと\n　コーンのポタージュ】","【かきたま汁】","【豚丼の具】","【お月見汁】","  "]
[null,"　キャベツ(40)　","　たまねぎ(35)　","⑦豆腐(25)　","　たまねぎ(65)　","⑦豆腐(25)　","  "]
[null,"　たまねぎ(40)　","　クリームコーン(30)　","○液卵(20)　","⑩豚肉(30)　","　大根(15)　","  "]
[null,"○うずら卵(25)　","◎牛乳(30)　","　たまねぎ(15)　","　しらたき(30)　","⑧鶏肉(10)　","  "]
[null,"①いか(20)　","⑧鶏肉(15)　","　かまぼこ(12)　","⑦焼き豆腐(20)　","　ねぎ(10)　","  "]
[null,"　にんじん(20)　","　にんじん(10)　","　にんじん(5)　","　ねぎ(13)　","　えのきたけ(10)　","  "]
[null,"⑩豚肉(20)　","　ぶなしめじ(8)　","　えのきたけ(5)　","　にんじん(10)　","　お月見かまぼこ(5)　","  "]
[null,"　たけのこ(10)　","　エリンギ(8)　","　ねぎ(5)　","　エリンギ(10)　","●⑦しょうゆ(4)　","  "]
[null,"　チンゲンサイ(10)　","　とうもろこし(5)　","●⑦しょうゆ(4)　","●⑦しょうゆ(6)　","　塩(0.3)　","  "]
[null,"●⑦しょうゆ(3)　","　ホワイトルウ\n　　　[えがお](6)　","　塩(0.3)　","　砂糖(3)　","　むろ削り(3)　","  "]
[null,"⑦⑧⑩⑯\n　中華だしの素(1.5)　","◎チーズ(1)　","　でん粉(1)　","　酒(2)　","","  "]
[null,"　でん粉(1)　","　パセリ(1)　","　むろ削り(4)　","","","  "]
[null,"　砂糖(0.5)　","⑦⑩洋風だしの素(1)　","","","","  "]
[null,"④ごま油(0.3)　","◎バター(1)　","","","","  "]
[null,"　塩(0.1)　","　白ワイン(1)　","","","","  "]
[null,"　こしょう(0.03)　","　塩(0.5)　","","","","  "]
[null,"","　こしょう(0.04)　","","","","  "]
[null,"","","","","","  "]
["フライ缶","【揚げぎょうざ】","【ジャーマンポテト】","【ささみしそ\n　　　梅肉フライ】","【いわしの\n　　　しょうが煮】","【里芋コロッケ】","  "]
[null,"　ぎょうざ 2個(36)　","　じゃがいも(40)　","　ささみしそ\n　  梅肉フライ 1個(50)　","　いわしの\n　しょうが煮 1個(40)　","　里芋コロッケ\n　　　　　1個(50)　","  "]
[null,"　米油(3.6)　","　たまねぎ(15)　","　米油(5)　","","　米油(5)　","  "]
[null,"","⑩ベーコン(10)　","","《いわしの\n　　　しょうが煮》","","  "]
[null,"《ぎょうざ》","⑦⑩洋風だしの素(0.5)　","《ささみしそ\n　　　梅肉フライ》","　いわし","《里芋コロッケ》","  "]
[null,"⑩豚肉","●⑦しょうゆ(0.3)　","⑧鶏肉","●⑦調味料等","　さといも","  "]
[null,"　キャベツ","　塩(0.1)　","●パン粉","","⑧鶏肉","  "]
[null,"●小麦粉","　こしょう(0.02)　","●小麦粉","","●パン粉","  "]
[null,"　たまねぎ","　米油(0.5)　","⑦植物性たん白","","●小麦粉","  "]
[null,"⑧鶏肉",null,null,null,"⑦植物性たん白","  "]
[null,"●パン粉",null,null,null,"●⑦調味料等","  "]
[null,"●粒状小麦たん白",null,null,null,null,"  "]
[null,"●⑦調味料等",null,null,null,null,"  "]
[null,"","","","","","  "]
["あえ物・果物","【もやしのナムル】","","【ブロッコリーの\n　　　  おかか和え】","【もやしと\n　　ひじきの和え物】","【きゅうりの\n　ごまじょうゆ和え】","  "]
[null,"　もやし(30)　","","　ブロッコリー(20)　","　もやし(20)　","　きゅうり(25)　","  "]
[null,"④白すりごま(1)　","","　花かつお(0.2)　","　ほうれん草(12)　","④白すりごま(0.5)　","  "]
[null,"●⑦しょうゆ(1)　","","●⑦しょうゆ(1)　","　味付けひじき(3)　","　花かつお(0.2)　","  "]
[null,"　砂糖(0.5)　","","　砂糖(0.3)　","","●⑦しょうゆ(1.2)　","  "]
[null,"　米酢(0.5)　","","","《味付けひじき》","④ごま油(0.2)　","  "]
[null,"④ごま油(0.3)　","","","　ひじき","","  "]
[null,null,null,null,"●⑦調味料等",null,"  "]
[null,"","","","","","  "]
["その他","","【いちじくジャム】","","","【月見団子】","  "]
[null,"","　いちじくジャム\n　　　　　  1袋(15)　","","","　お月見団子 1袋(45)　","  "]
[null,null,null,null,null,null,"  "]
[null,null,null,null,null,"《お月見団子》","  "]
[null,null,null,null,null,"　米粉","  "]
[null,"","","","","⑦⑮調味料等","  "]
[null,"","","","","","  "]
["　",null,null,null,null,"（　）内は純使用量　単位：グラム","  "]
[null,null,null,null,null,null,"  "]
[null,null,null,null,null,null,"  "]
[null,null,null,null,null,null,"  "]
[null,null,null,null,null,null,"  "]
[null,null,null,null,null,null,"  "]
[null,null,null,null,null,null,"  "]
[null,null,null,null,null,null,"  "]
["　",null,null,null,null,null,"  "]
["　",null,null,null,null,"小学校－３","  "]
["日","2024-09-18","2024-09-19","2024-09-20","2024-09-24","2024-09-25","  "]
["主食","麦ごはん","ごはん","●中華めん","麦ごはん","ごはん","  "]
["牛乳","◎牛乳","◎はっこう乳","◎牛乳","◎牛乳","◎牛乳","  "]
["食缶","【ごじる】","【肉じゃが】","【しょうゆ\n　ラーメンのスープ】","【ジャーチャン\n　　　　　 ドウフ】","【里芋の煮物】","  "]
[null,"⑦豆腐(25)　","　じゃがいも(90)　","　もやし(20)　","⑦生揚げ(40)　","　さといも(35)　","  "]
[null,"　大根(20)　","　たまねぎ(40)　","⑩豚肉(15)　","　たまねぎ(40)　","　大根(30)　","  "]
[null,"⑦大豆(15)　","　こんにゃく(20)　","　なると(12)　","⑩豚肉(25)　","⑦がんもどき(20)　","  "]
[null,"　ごぼう(15)　","　にんじん(20)　","　ねぎ(10)　","　にんじん(15)　","　にんじん(15)　","  "]
[null,"　ねぎ(10)　","⑩豚肉(15)　","　たけのこ(10)　","　ねぎ(7)　","　さやいんげん(10)　","  "]
[null,"　にんじん(10)　","　グリンピース(4)　","　にんじん(10)　","　しいたけ(0.5)　","　しいたけ(1)　","  "]
[null,"⑦油揚げ(3)　","●⑦しょうゆ(4.5)　","　わかめ(0.4)　","　しょうが(0.5)　","●⑦しょうゆ(5)　","  "]
[null,"⑦豆乳(15)　","　砂糖(3)　","⑧チキンブイヨン(30)　","●⑦しょうゆ(5)　","　砂糖(3)　","  "]
[null,"⑦あわせみそ(9)　","　本みりん(1)　","●⑦しょうゆ(7.5)　","⑦豆みそ(2.5)　","　本みりん(1)　","  "]
[null,"　酒(2)　","　塩(0.2)　","⑦⑧⑩⑯\n　中華だしの素(1.5)　","　砂糖(2)　","　むろ削り(1)　","  "]
[null,"　むろ削り(3)　","　こしょう(0.02)　","④ごま油(0.3)　","　豆板醤(0.1)　","","  "]
[null,"","","　塩(0.12)　","　でん粉(1)　","","  "]
[null,"","","　こしょう(0.04)　","","","  "]
[null,"","","","","","  "]
["フライ缶","【ひじき入り\n　　　親子そぼろ】","【三色あえ】","【あいちの\n　　しそ入り春巻き】","【バンバンジー\n　　　　　 サラダ】","【さば銀紙焼き】","  "]
[null,"⑧鶏肉(18)　","　もやし(15)　","　春巻き 1個(50)　","　きゅうり(35)　","　さば銀紙焼き\n　　　　　1個(50)　","  "]
[null,"○炒り卵(17)　","　小松菜(12)　","　米油(5)　","⑧サラダチキン(20)　","","  "]
[null,"　たまねぎ(15)　","　まぐろ油漬け(10)　","","　とうもろこし(10)　","《さば銀紙焼き》","  "]
[null,"　にんじん(10)　","　にんじん(5)　","《春巻き》","　にんじん(5)　","⑥さば","  "]
[null,"　とうもろこし(5)　","　切り干し大根(2.5)　","⑧鶏肉","④白ねりごま(3)　","⑦調味料等","  "]
[null,"　米ひじき(1.5)　","④白すりごま(2)　","　たまねぎ","④白すりごま(1)　","","  "]
[null,"●⑦しょうゆ(3)　","④白ねりごま(2)　","　キャベツ","●⑦しょうゆ(1.8)　","","  "]
[null,"　砂糖(2)　","●⑦しょうゆ(2.5)　","⑦粒状大豆たん白","　砂糖(1.5)　","","  "]
[null,"　本みりん(0.5)　","　砂糖(1)　","●小麦粉","　米酢(1)　","","  "]
[null,"　酒(0.5)　","","●⑦⑧調味料等","④ごま油(0.5)　","","  "]
[null,"","","","","","  "]
["あえ物・果物","","","【切り干し大根と\n　　小松菜の和え物】","【冷凍みかん】","【もやしの\n　　　塩昆布和え】","  "]
[null,"","","　小松菜(12)　","　みかん 1個(120)　","　もやし(20)　","  "]
[null,"","","　切り干し大根(2.5)　","","　ほうれん草(10)　","  "]
[null,"","","●⑦しょうゆ(1)　","","　にんじん(5)　","  "]
[null,"","","　砂糖(0.5)　","","　塩昆布(1.2)　","  "]
[null,"","","　米酢(0.5)　","","","  "]
[null,"","","④ごま油(0.3)　","","《塩昆布》","  "]
[null,null,null,null,null,"　昆布","  "]
[null,null,null,null,null,"●⑦調味料等","  "]
[null,"","","","","","  "]
["その他","【いわしの干し小魚】","【プルーン】","","","【おはぎ】","  "]
[null,"　いわしの\n　　干し小魚 1袋(5)　","　プルーン 1袋(20)　","","","　おはぎ 1袋(30)　","  "]
[null,"","","","","","  "]
["　",null,null,null,null,"（　）内は純使用量　単位：グラム","  "]
["　",null,null,null,null,null,"  "]
["　",null,null,null,null,"小学校－４","  "]
["日","2024-09-26","2024-09-27","2024-09-30",null,null,"  "]
["主食","麦ごはん","◎●⑦サンドイッチ\n　　　　  　ロールパン","麦ごはん",null,null,"  "]
["牛乳","◎牛乳","◎牛乳","◎牛乳",null,null,"  "]
["食缶","【とうがんの\n　　カレースープ】","【ABCスープ】","【ハッシュドビーフ】",null,null,"  "]
[null,"　とうがん(25)　","　じゃがいも(30)　","　たまねぎ(50)　",null,null,"  "]
[null,"⑧鶏肉(20)　","　たまねぎ(20)　","③牛肉(30)　",null,null,"  "]
[null,"　たまねぎ(20)　","⑧鶏肉(10)　","　にんじん(15)　",null,null,"  "]
[null,"　にんじん(15)　","　とうもろこし(10)　","　グリンピース(4)　",null,null,"  "]
[null,"　とうもろこし(10)　","　ひよこ豆(10)　","　にんにく(0.3)　",null,null,"  "]
[null,"　エリンギ(10)　","　にんじん(10)　","　ハヤシルウ\n　　　[えがお](12)　",null,null,"  "]
[null,"　カレールウ\n　　　[えがお](8)　","●ABCパスタ(3)　","　トマトピューレ(10)　",null,null,"  "]
[null,"●⑦しょうゆ(2.5)　","⑦⑩洋風だしの素(2)　","　デミグラスソース(6)　",null,null,"  "]
[null,"　本みりん(1.5)　","　白ワイン(1)　","　トマトケチャップ(5)　",null,null,"  "]
[null,"　野菜ブイヨン(0.8)　","●⑦しょうゆ(1)　","　赤ワイン(1)　",null,null,"  "]
[null,"　塩(0.2)　","　塩(0.3)　","⑦⑩洋風だしの素(0.5)　",null,null,"  "]
[null,"　純カレー(0.02)　","　こしょう(0.03)　","　塩(0.3)　",null,null,"  "]
[null,"","","　砂糖(0.2)　",null,null,"  "]
[null,"",null,"　こしょう(0.03)　",null,null,"  "]
[null,null,null,null,null,null,"  "]
[null,null,null,"《デミグラスソース》",null,null,"  "]
[null,null,null,"●小麦粉",null,null,"  "]
[null,null,null,"　トマト",null,null,"  "]
[null,null,null,"⑧⑩調味料等",null,null,"  "]
[null,"","","",null,null,"  "]
["フライ缶","【豚肉の\n　　しょうが炒め】","【ロングハンバーグの\n　   トマトソースかけ】","【ごぼうサラダ】",null,null,"  "]
[null,"⑩豚肉(30)　","　ハンバーグ 1個(50)　","　ごぼう(10)　",null,null,"  "]
[null,"　もやし(25)　","　野菜ミックス(10)　","　まぐろ油漬け(10)　",null,null,"  "]
[null,"　たまねぎ(15)　","　ベジタブル\n　　　　ソース(10)　","　きゅうり(10)　",null,null,"  "]
[null,"　にんじん(10)　","　トマト\n　ケチャップ(5)　","⑦枝豆(10)　",null,null,"  "]
[null,"　ピーマン(4)　","　ソース(1)　","　にんじん(8)　",null,null,"  "]
[null,"　しょうが(1)　","　赤ワイン(0.5)　","　コーンクリーミー\n　   ドレッシング(6)　",null,null,"  "]
[null,"●⑦しょうゆ(2.5)　","　砂糖(0.3)　","●⑦しょうゆ(1.5)　",null,null,"  "]
[null,"　砂糖(1.5)　","　塩(0.1)　","　砂糖(0.5)　",null,null,"  "]
[null,"　酒(1)　","","　米酢(0.5)　",null,null,"  "]
[null,"　塩(0.1)　","《ハンバーグ》","　塩(0.1)　",null,null,"  "]
[null,"　こしょう(0.02)　","⑩豚肉","　こしょう(0.02)　",null,null,"  "]
[null,"　でん粉(0.5)　","⑧鶏肉","",null,null,"  "]
[null,null,"　たまねぎ",null,null,null,"  "]
[null,null,"　米粉",null,null,null,"  "]
[null,null,"⑦粒状大豆たん白",null,null,null,"  "]
[null,null,"⑩調味料等",null,null,null,"  "]
[null,"","","",null,null,"  "]
["あえ物・果物",null,"【フレンチサラダ】","",null,null,"  "]
[null,"　《野菜ミックス》　","　キャベツ(25)　","",null,null,"  "]
[null,"　　ズッキーニ","　にんじん(3)　","",null,null,"  "]
[null,"　　黄ピーマン","　フレンチ\n　 ドレッシング(2)　","",null,null,"  "]
[null,"　　赤ピーマン",null,null,null,null,"  "]
[null,"　　たまねぎ",null,null,null,null,"  "]
[null,"　　にんじん",null,null,null,null,"  "]
[null,"","","",null,null,"  "]
["その他","【ぶどうゼリー】",null,"【きらず揚げ】",null,null,"  "]
[null,"　ぶどうゼリー \n　　　　　1個(60)　","　《ベジタブルソース》　","　きらず揚げ 1袋(8)　",null,null,"  "]
[null,"","　　トマト","",null,null,"  "]
[null,null,"　　たまねぎ","《きらず揚げ》",null,null,"  "]
[null,null,"　　セロリ","●小麦粉",null,null,"  "]
[null,null,"　　にんにく","⑦おからパウダー",null,null,"  "]
[null,null,"　⑦調味料等","　調味料等",null,null,"  "]
[null,"","","",null,null,"  "]
["　",null,null,"（　）内は純使用量　単位：グラム",null,null,"  "]
["　"]

{"sheet":"対象者","index":1,"n_rows":101,"n_cols":21,"rows_kept":101,"cut":false,"hidden":true,"merged":[]}
["番号","学校","学年","組","氏名","アレ１","１記号","アレ２","２記号","アレ３","３記号","アレ４","４記号","アレ５","５記号","アレ６","６記号","アレ７","７記号",1,"アレルゲンはドロップダウンリストから選択してください。"]
[1,null,null,null,null,null,"---",null,"---",null,"---",null,"---",null,"---",null,"---",null,"---",2,"アレルギー献立表に表示可能なアレルゲンは５種類までとなります。※６、７は参考入力"]
[2,null,null,null,null,null,"---",null,"---",null,"---",null,"---",null,"---",null,"---",null,"---","※","５種類を超えるアレルゲンのある場合は、弁当持参を促すべき児童生徒と言えます。"]
[3,null,null,null,null,null,"---",null,"---",null,"---",null,"---",null,"---",null,"---",null,"---",3,"このリストをアレルギー献立表の「対象者」シートにコピーして「値のみ」を貼り付けてください。"]
[4,null,null,null,null,null,"---",null,"---",null,"---",null,"---",null,"---",null,"---",null,"---",4,"対象者を100人以上登録したいときは、A100～R101を選択してコピー（又はオートフィル）してください。"]
[5,null,null,null,null,null,"---",null,"---",null,"---",null,"---",null,"---",null,"---",null,"---"]
[6,null,null,null,null,null,"---",null,"---",null,"---",null,"---",null,"---",null,"---",null,"---"]
[7,null,null,null,null,null,"---",null,"---",null,"---",null,"---",null,"---",null,"---",null,"---"]
[8,null,null,null,null,null,"---",null,"---",null,"---",null,"---",null,"---",null,"---",null,"---"]
[9,null,null,null,null,null,"---",null,"---",null,"---",null,"---",null,"---",null,"---",null,"---"]
[10,null,null,null,null,null,"---",null,"---",null,"---",null,"---",null,"---",null,"---",null,"---"]
[11,null,null,null,null,null,"---",null,"---",null,"---",null,"---",null,"---",null,"---",null,"---"]
[12,null,null,null,null,null,"---",null,"---",null,"---",null,"---",null,"---",null,"---",null,"---"]
[13,null,null,null,null,null,"---",null,"---",null,"---",null,"---",null,"---",null,"---",null,"---"]
[14,null,null,null,null,null,"---",null,"---",null,"---",null,"---",null,"---",null,"---",null,"---"]
[15,null,null,null,null,null,"---",null,"---",null,"---",null,"---",null,"---",null,"---",null,"---"]
[16,null,null,null,null,null,"---",null,"---",null,"---",null,"---",null,"---",null,"---",null,"---"]
[17,null,null,null,null,null,"---",null,"---",null,"---",null,"---",null,"---",null,"---",null,"---"]
[18,null,null,null,null,null,"---",null,"---",null,"---",null,"---",null,"---",null,"---",null,"---"]
[19,null,null,null,null,null,"---",null,"---",null,"---",null,"---",null,"---",null,"---",null,"---"]
[20,null,null,null,null,null,"---",null,"---",null,"---",null,"---",null,"---",null,"---",null,"---"]
[21,null,null,null,null,null,"---",null,"---",null,"---",null,"---",null,"---",null,"---",null,"---"]
[22,null,null,null,null,null,"---",null,"---",null,"---",null,"---",null,"---",null,"---",null,"---"]
[23,null,null,null,null,null,"---",null,"---",null,"---",null,"---",null,"---",null,"---",null,"---"]
[24,null,null,null,null,null,"---",null,"---",null,"---",null,"---",null,"---",null,"---",null,"---"]
[25,null,null,null,null,null,"---",null,"---",null,"---",null,"---",null,"---",null,"---",null,"---"]
[26,null,null,null,null,null,"---",null,"---",null,"---",null,"---",null,"---",null,"---",null,"---"]
[27,null,null,null,null,null,"---",null,"---",null,"---",null,"---",null,"---",null,"---",null,"---"]
[28,null,null,null,null,null,"---",null,"---",null,"---",null,"---",null,"---",null,"---",null,"---"]
[29,null,null,null,null,null,"---",null,"---",null,"---",null,"---",null,"---",null,"---",null,"---"]
[30,null,null,null,null,null,"---",null,"---",null,"---",null,"---",null,"---",null,"---",null,"---"]
[31,null,null,null,null,null,"---",null,"---",null,"---",null,"---",null,"---",null,"---",null,"---"]
[32,null,null,null,null,null,"---",null,"---",null,"---",null,"---",null,"---",null,"---",null,"---"]
[33,null,null,null,null,null,"---",null,"---",null,"---",null,"---",null,"---",null,"---",null,"---"]
[34,null,null,null,null,null,"---",null,"---",null,"---",null,"---",null,"---",null,"---",null,"---"]
[35,null,null,null,null,null,"---",null,"---",null,"---",null,"---",null,"---",null,"---",null,"---"]
[36,null,null,null,null,null,"---",null,"---",null,"---",null,"---",null,"---",null,"---",null,"---"]
[37,null,null,null,null,null,"---",null,"---",null,"---",null,"---",null,"---",null,"---",null,"---"]
[38,null,null,null,null,null,"---",null,"---",null,"---",null,"---",null,"---",null,"---",null,"---"]
[39,null,null,null,null,null,"---",null,"---",null,"---",null,"---",null,"---",null,"---",null,"---"]
[40,null,null,null,null,null,"---",null,"---",null,"---",null,"---",null,"---",null,"---",null,"---"]
[41,null,null,null,null,null,"---",null,"---",null,"---",null,"---",null,"---",null,"---",null,"---"]
[42,null,null,null,null,null,"---",null,"---",null,"---",null,"---",null,"---",null,"---",null,"---"]
[43,null,null,null,null,null,"---",null,"---",null,"---",null,"---",null,"---",null,"---",null,"---"]
[44,null,null,null,null,null,"---",null,"---",null,"---",null,"---",null,"---",null,"---",null,"---"]
[45,null,null,null,null,null,"---",null,"---",null,"---",null,"---",null,"---",null,"---",null,"---"]
[46,null,null,null,null,null,"---",null,"---",null,"---",null,"---",null,"---",null,"---",null,"---"]
[47,null,null,null,null,null,"---",null,"---",null,"---",null,"---",null,"---",null,"---",null,"---"]
[48,null,null,null,null,null,"---",null,"---",null,"---",null,"---",null,"---",null,"---",null,"---"]
[49,null,null,null,null,null,"---",null,"---",null,"---",null,"---",null,"---",null,"---",null,"---"]
[50,null,null,null,null,null,"---",null,"---",null,"---",null,"---",null,"---",null,"---",null,"---"]
[51,null,null,null,null,null,"---",null,"---",null,"---",null,"---",null,"---",null,"---",null,"---"]
[52,null,null,null,null,null,"---",null,"---",null,"---",null,"---",null,"---",null,"---",null,"---"]
[53,null,null,null,null,null,"---",null,"---",null,"---",null,"---",null,"---",null,"---",null,"---"]
[54,null,null,null,null,null,"---",null,"---",null,"---",null,"---",null,"---",null,"---",null,"---"]
[55,null,null,null,null,null,"---",null,"---",null,"---",null,"---",null,"---",null,"---",null,"---"]
[56,null,null,null,null,null,"---",null,"---",null,"---",null,"---",null,"---",null,"---",null,"---"]
[57,null,null,null,null,null,"---",null,"---",null,"---",null,"---",null,"---",null,"---",null,"---"]
[58,null,null,null,null,null,"---",null,"---",null,"---",null,"---",null,"---",null,"---",null,"---"]
[59,null,null,null,null,null,"---",null,"---",null,"---",null,"---",null,"---",null,"---",null,"---"]
[60,null,null,null,null,null,"---",null,"---",null,"---",null,"---",null,"---",null,"---",null,"---"]
[61,null,null,null,null,null,"---",null,"---",null,"---",null,"---",null,"---",null,"---",null,"---"]
[62,null,null,null,null,null,"---",null,"---",null,"---",null,"---",null,"---",null,"---",null,"---"]
[63,null,null,null,null,null,"---",null,"---",null,"---",null,"---",null,"---",null,"---",null,"---"]
[64,null,null,null,null,null,"---",null,"---",null,"---",null,"---",null,"---",null,"---",null,"---"]
[65,null,null,null,null,null,"---",null,"---",null,"---",null,"---",null,"---",null,"---",null,"---"]
[66,null,null,null,null,null,"---",null,"---",null,"---",null,"---",null,"---",null,"---",null,"---"]
[67,null,null,null,null,null,"---",null,"---",null,"---",null,"---",null,"---",null,"---",null,"---"]
[68,null,null,null,null,null,"---",null,"---",null,"---",null,"---",null,"---",null,"---",null,"---"]
[69,null,null,null,null,null,"---",null,"---",null,"---",null,"---",null,"---",null,"---",null,"---"]
[70,null,null,null,null,null,"---",null,"---",null,"---",null,"---",null,"---",null,"---",null,"---"]
[71,null,null,null,null,null,"---",null,"---",null,"---",null,"---",null,"---",null,"---",null,"---"]
[72,null,null,null,null,null,"---",null,"---",null,"---",null,"---",null,"---",null,"---",null,"---"]
[73,null,null,null,null,null,"---",null,"---",null,"---",null,"---",null,"---",null,"---",null,"---"]
[74,null,null,null,null,null,"---",null,"---",null,"---",null,"---",null,"---",null,"---",null,"---"]
[75,null,null,null,null,null,"---",null,"---",null,"---",null,"---",null,"---",null,"---",null,"---"]
[76,null,null,null,null,null,"---",null,"---",null,"---",null,"---",null,"---",null,"---",null,"---"]
[77,null,null,null,null,null,"---",null,"---",null,"---",null,"---",null,"---",null,"---",null,"---"]
[78,null,null,null,null,null,"---",null,"---",null,"---",null,"---",null,"---",null,"---",null,"---"]
[79,null,null,null,null,null,"---",null,"---",null,"---",null,"---",null,"---",null,"---",null,"---"]
[80,null,null,null,null,null,"---",null,"---",null,"---",null,"---",null,"---",null,"---",null,"---"]
[81,null,null,null,null,null,"---",null,"---",null,"---",null,"---",null,"---",null,"---",null,"---"]
[82,null,null,null,null,null,"---",null,"---",null,"---",null,"---",null,"---",null,"---",null,"---"]
[83,null,null,null,null,null,"---",null,"---",null,"---",null,"---",null,"---",null,"---",null,"---"]
[84,null,null,null,null,null,"---",null,"---",null,"---",null,"---",null,"---",null,"---",null,"---"]
[85,null,null,null,null,null,"---",null,"---",null,"---",null,"---",null,"---",null,"---",null,"---"]
[86,null,null,null,null,null,"---",null,"---",null,"---",null,"---",null,"---",null,"---",null,"---"]
[87,null,null,null,null,null,"---",null,"---",null,"---",null,"---",null,"---",null,"---",null,"---"]
[88,null,null,null,null,null,"---",null,"---",null,"---",null,"---",null,"---",null,"---",null,"---"]
[89,null,null,null,null,null,"---",null,"---",null,"---",null,"---",null,"---",null,"---",null,"---"]
[90,null,null,null,null,null,"---",null,"---",null,"---",null,"---",null,"---",null,"---",null,"---"]
[91,null,null,null,null,null,"---",null,"---",null,"---",null,"---",null,"---",null,"---",null,"---"]
[92,null,null,null,null,null,"---",null,"---",null,"---",null,"---",null,"---",null,"---",null,"---"]
[93,null,null,null,null,null,"---",null,"---",null,"---",null,"---",null,"---",null,"---",null,"---"]
[94,null,null,null,null,null,"---",null,"---",null,"---",null,"---",null,"---",null,"---",null,"---"]
[95,null,null,null,null,null,"---",null,"---",null,"---",null,"---",null,"---",null,"---",null,"---"]
[96,null,null,null,null,null,"---",null,"---",null,"---",null,"---",null,"---",null,"---",null,"---"]
[97,null,null,null,null,null,"---",null,"---",null,"---",null,"---",null,"---",null,"---",null,"---"]
[98,null,null,null,null,null,"---",null,"---",null,"---",null,"---",null,"---",null,"---",null,"---"]
[99,null,null,null,null,null,"---",null,"---",null,"---",null,"---",null,"---",null,"---",null,"---"]
[100,null,null,null,null,null,"---",null,"---",null,"---",null,"---",null,"---",null,"---",null,"---"]

{"sheet":"アレルゲン","index":2,"n_rows":5,"n_cols":4,"rows_kept":5,"cut":false,"hidden":true,"merged":[]}
[1,{"$f":"VLOOKUP(D$1,対象者!$A:$S,7,FALSE)","v":{"$error":"#N/A"}},"個人番号",{"$f":"'アレルギー献立表 (小)'!H3","v":0}]
[2,{"$f":"VLOOKUP(D$1,対象者!$A:$S,9,FALSE)","v":{"$error":"#N/A"}}]
[3,{"$f":"VLOOKUP(D$1,対象者!$A:$S,11,FALSE)","v":{"$error":"#N/A"}}]
[4,{"$f":"VLOOKUP(D$1,対象者!$A:$S,13,FALSE)","v":{"$error":"#N/A"}}]
[5,{"$f":"VLOOKUP(D$1,対象者!$A:$S,15,FALSE)","v":{"$error":"#N/A"}}]